{"text_format":"1","workbook":"xlsx","n_sheets":12,"sheets":["CurTiPot","   pH_calc   ","+pH","Titration","Simulation","Distribution","Evaluation","+Eva","Regression","+Reg","Graphs","Database"],"not_rendered":{"charts":21,"images":6,"macros":1,"external_links":0,"defined_names":40,"comments":11,"pivot_tables":0},"unopened":[],"bounds":{"document_bytes":16777216,"sheet_cells":100000,"rows_first":2000,"rows_last":500,"rows_between":2000,"halvings":0,"cell_chars":16384,"cell_head_chars":4096},"cells_cut":0,"cells_raw":0,"read":"whole","date_system":"1900"}

{"sheet":"CurTiPot","index":0,"n_rows":51,"n_cols":39,"rows_kept":51,"cut":false,"hidden":false,"merged":[]}
[null,null,null,null,null,null,null,null,null,null,null,null,null,null,null,null,null,"CurTiPot main features and uses"]
[null,null,null,null,null,null,null,null,null,null,null,null,null,null,null,null,null,"•  pH calculation of aqueous solutions with activity coefficient and buffer capacity estimation (mixtures of up to seven hexaprotic systems)"]
[null,null,null,null,null,null,null,null,null,null,null,null,null,null,null,null,null,"•  Virtual Titration with indicator color transition simulation, manual titrant addition with a digital burette, species distribution and pH vs. volume plot"]
[null,null,null,null,null,null,null,null,null,null,null,null,null,null,null,null,null,"•  Simulation of simple and complex acid-base titration curves"]
[null,null,null,null,null,null,null,null,null,null,null,null,null,null,null,null,null,"    »  automatic generation of curves with data equally spaced in pH or volume, in concentration (\"pH\") or activity (pH)"]
[null,null,null,null,null,null,null,null,null,null,null,null,null,null,null,null,null,"    »  simulation of experimental random errors in pH and volume; overlay of multiple curves for comparison"]
[null,null,null,null,null,null,null,null,null,null,null,null,null,null,null,null,null,"•  Data analysis of real and simulated curves of acid-base titrations"]
[null,null,null,null,null,null,null,null,null,null,null,null,null,null,null,null,null,"    »  Evaluation of curves with enhanced accuracy by interpolation, spline smoothing and automatic endpoint detection"]
[null,null,null,null,null,null,null,null,null,null,null,null,null,null,null,null,null,"    »  Non-linear data Regression for the determination of concentrations and refinement of pKa values"]
[null,null,null,null,null,null,null,null,null,null,null,null,null,null,null,null,null,"•  Distribution diagrams of species, protonation of bases, isoelectric point and buffer capacity vs. pH and vs. volume of a titration"]
[null,null,null,null,null,null,null,null,null,null,null,null,null,null,null,null,null,"•  Database with equilibrium constants (pKa) of 250 acid-base systems including amino acids and some indicators (expandable by the user) "]
[]
[null,null,null,null,null,null,null,null,null,null,null,null,null,null,null,null,null,"No installation needed. Download the latest release of CurTiPot from www.iq.usp.br/gutz/Curtipot_.html and open the file with Microsoft Excel® "]
[null,null,null,null,null,null,null,null,null,null,null,null,null,null,null,null,null,"Before using the program, make sure you agree with all the terms of the License reproduced at the end of this page (cells B50 to O100)"]
[null,null,null,null,null,null,null,null,null,null,null,null,null,null,null,null,null,"If you agree with all terms of the License, enable macros and use CurTiPot freely for non-commercial purposes"]
[null,null,null,null,null,null,null,null,null,null,null,null,null,null,null,null,null,"To enable the execution of macro-instructions in MS Excel follow instructions at the right   ------->               ------->               ------->               ------->               ------->               ------->              ",null,null,null,null,null,null,null,null,null,null,null,null,null,null,null,null,null,null,null,null,"How to enable Excel files with macros and use CurTiPot"]
[null,null,null,null,null,null,null,null,null,null,null,null,null,null,null,null,null,"The Solver supplement is required only by the Regression module. Follow activation instructions given in the cell I19 of the module",null,null,null,null,null,null,null,null,null,null,null,null,null,null,null,null,null,null,null,null,"Excel and Office for Windows"]
[null,null,null,null,null,null,null,null,null,null,null,null,null,null,null,null,null,null,null,null,null,null,null,null,null,null,null,null,null,null,null,null,null,null,null,null,null,null,"1. Download CurTiPot from the author's website to the folder of your preference"]
[null,null,null,null,null,null,null,null,null,null,null,null,null,null,null,null,null,"The author reserves the right not to be responsible for the correctness, completeness, accuracy and bug-free operation of the freeware CurTiPot, provided \"as is\" without warranty of any kind",null,null,null,null,null,null,null,null,null,null,null,null,null,null,null,null,null,null,null,null,"2. Open the folder and right-click on the file curtipot_.xlsm"]
[null,null,null,null,null,null,null,null,null,null,null,null,null,null,null,null,null,"Activity coefficient calculations, available in the pH_calc, Simulation, Distribution and Regression modules, are subject to the limitations of the Daniel equation at ionic strength >0.1 mol/L",null,null,null,null,null,null,null,null,null,null,null,null,null,null,null,null,null,null,null,null,"3. Select \"Properties\" in the pop-up window"]
[null,null,null,null,null,null,null,null,null,null,null,null,null,null,null,null,null,"CurTiPot only considers protonation equilibria in water, ignoring other equilibria, interactions and reactions, for example, oxidtion/reduction between two or more acid-base systems present",null,null,null,null,null,null,null,null,null,null,null,null,null,null,null,null,null,null,null,null,"4. Check the \"unlock\" key (usually near the bottom right corner)"]
[null,null,null,null,null,null,null,null,null,null,null,null,null,null,null,null,null,"Please report errors and incompatibilities of CurTiPot for MS Excel  (PC and Mac)  to the author;",null,null,null,null,null,null,null,null,null,null,"Use the e-mail: ","gutz@iq.usp.br",null,null,null,null,null,null,null,null,"5. Click OK"]
[null,null,null,null,null,null,null,null,null,null,null,null,null,null,null,null,null,"Due to the wide range of screen resolutions in use nowadays, some resizing/replacement of figures and objects may be required",null,null,null,null,null,null,null,null,null,null,null,null,null,null,null,null,null,null,null,null,"6. Double click the curtipot_.xlsm file to open it"]
[null,null,null,null,null,null,null,null,null,null,null,null,null,null,null,null,null,null,null,null,null,null,null,null,null,null,null,null,null,null,null,null,null,null,null,null,null,null,"7. Select \"Enable content\""]
[null,null,null,null,null,null,null,null,null,null,null,null,null,null,null,null,null,"Enable macros (see cell R16 above); click on a tab at the bottom left of this page or press Ctrl + PgDn switch modules; follow instructions in the yellow balloons",null,null,null,null,null,null,null,null,null,null,null,null,null,null,null,null,null,null,null,null,"8. Read the front page of CurTiPot "]
[null,null,null,null,null,null,null,null,null,null,null,null,null,null,null,null,null,"Titration could be a nice start for beginners; pH_calc has too much stuff to grasp at once, but the pH is highlighted in the dark blue cell H23;",null,null,null,null,null,null,null,null,null,null,null,null,null,null,null,null,null,null,null,null,"9. Use the program"]
[null,null,null,null,null,null,null,null,null,null,null,null,null,null,null,null,null,"Read local instructions in comment boxes by placing the mouse on cells with red marks (like in Q14 and Q34 at this page);",null,null,null,null,null,null,null,null,null,null,null,null,null,null,null,null,null,null,null,null,"10. Save your data, settings and results as Curtipot_anyname.xlsm"]
[null,null,null,null,null,null,null,null,null,null,null,null,null,null,null,null,null,"Switch to the Simulation module and repeat the preloaded titration of phosphoric acid; start clicking on the buttons at the left of the figure; change some concentrations afterwards;",null,null,null,null,null,null,null,null,null,null,null,null,null,null,null,null,null,null,null,null,"11.  All macros are fully removed when closing the file"]
[null,null,null,null,null,null,null,null,null,null,null,null,null,null,null,null,null,"Find endpoints of your real or simulated curves with Evaluation and save them in +Eva. There are buttons to transfer data from Simulation do Evaluation and vice-versa;"]
[null,null,null,null,null,null,null,null,null,null,null,null,null,null,null,null,null,"Play with the Distribution module and enjoy the Graphs before you try curve modeling with the less simple but more powerful Regression module to fit concentrations and pKas;",null,null,null,null,null,null,null,null,null,null,null,null,null,null,null,null,null,null,null,null,"Older Office versions"]
[" "," "," "," "," "," "," "," "," "," "," "," "," "," "," "," ",null,"Save your data, settings and results in Curtipot_anyname.xlsm files to preserve the original software (optionally deleting unused spreadsheets, with exception of this first one).",null,null,null,null,null,null,null,null,null,null,null,null,null,null,null,null,null,null,null,null,"1. Open a new blank Excel spreadsheet "]
[" "," "," "," "," "," "," "," "," "," "," ",null,null,null,null,null,null,null,null,null,null,null,null,null,null,null,null,null,null,null,null,null,null,null,null,null,null,null,"2. Click on the File tab (or the Office button, in Windows XP)(top left corner)"]
[" ",null,null,null,null,null,null,null,null,null,null,null,null,null,null,null,null,"The software CurTiPot, version 1.0 for DOS (Borland Turbo Basic and Microsoft Disk Operating System), was created in 1991 and launched in 1992.",null,null,null,null,null,null,null,null,null,null,null,null,null,null,null,null,null,null,null,null,"3. Click on \"Options\" (bottom left)"]
[" "," ",null,"Dr. Ivano Gebhardt Rolf Gutz -  Full Professor (since 1992)",null,null,null,null,null,null,null,null,null,null,null,null,null,"Read more about the name, origins and customers of CurTiPot in cells R54 to AD79",null,null,null,null,null,null,null,null,null,null,null,null,null,null,null,null,null,null,null,null,"4. Click on \"Trust Center\" (bottom left)"]
[" "," ",null,"Instituto de Química - Universidade de São Paulo, São Paulo, SP, Brazil",null,null,null,null,null,null,null,null,null,null,null,null,null,"Version 2, improved and adapted for titrations with coulometric generation of reactants, was released in 1992.",null,null,null,null,null,null,null,null,null,null,null,null,null,null,null,null,null,null,null,null,"5. Click on \"Trust Center Settings\" (bottom right)"]
[" "," ",null,"Honored as a Commander of the National Order of Scientific Merit, Brazil, 2007",null,null,null,null,null,null,null,null,null,null,null,null,null,"Version 3.0 for Excel, an evolution of the DOS version with added Regression module was released in 2006 (in Portuguese).",null,null,null,null,null,null,null,null,null,null,null,null,null,null,null,null,null,null,null,null,"6. Click on \"Macro Settings\""]
[" "," ",null,"Elected Member of the Brazilian Academy of Sciences, 2008",null,null,null,null,null,null,null,null,null,null,null,null,null,"Version 3.1 was the first release translated to English, launched on the internet in May 1st, 2006.",null,null,null,null,null,null,null,null,null,null,null,null,null,null,null,null,null,null,null,null,"7. Click on \"Disable macros with notification\""]
[" "," ",null,"Elected Member Academy of Sciences of the State of São Paulo, 2007",null,null,null,null,null,null,null,null,null,null,null,null,null,"Version 3.2, released in December 2006, includes a separate pH_calc module with activity coefficient estimation.",null,null,null,null,null,null,null,null,null,null,null,null,null,null,null,null,null,null,null,null,"8. Click OK; follow steps 1 to 8 only once on each computer"]
[null,null,null,"Fellow of the International Union of Pure and Applied Chemistry, 2002",null,null,null,null,null,null,null,null,null,null,null,null,null,"Version 3.3, January 2008, has a friendlier interface with the Database and includes logarithmic distribution diagram generation overlaid on the titration curve.",null,null,null,null,null,null,null,null,null,null,null,null,null,null,null,null,null,null,null,null,"9. Open the CurTiPot file"]
[null,null,null,"Research interests, CV, publications, see: https://www.iq.usp.br/gutz and",null,null,null,null,null,null,null,null,null,null,null,null,null,"Version 3.4, October 2008, extends Ionic strength and activity coefficient calculations to the Regression module (formerly available only in pH_calc).",null,null,null,null,null,null,null,null,null,null,null,null,null,null,null,null,null,null,null,null,"10. When the \"Security warning\" shows up, click on it to enable content"]
[null,null,null,"https://scholar.google.com.br/citations?user=qXFK1_YAAAAJ&hl=pt-BR",null,null,null,null,null,null,null,null,null,null,null,null,null,"Version 3.5, Jan/Feb 2010, calculates Buffer Capacity (BC) and medium charge (zm) (pH_calc module) and plots BC and zm and finds the isoelectric point (Distribution module).",null,null,null,null,null,null,null,null,null,null,null,null,null,null,null,null,null,null,null,null,"11. Follow the steps 8 to 11 above"]
[null,null,null,null,null,null,null,null,null,null,null,null,null,null,null,null,null,"Version 3.6, March 2012 - Inflections (endpoints) of real and simulated titrations are located automatically by the improved Evaluation module, with smoothing and interpolation. "]
[null,"In a survey of 21 free buffer calculators and Apps, the use of CurTiPot",null,null,null,null,null,null,null,null,null,null,null,null,null,null,null,"Version 4.0, January 2014 - Titration module for students introduced, embracing visual and instrumental end point detection; activity calculation extended to Simulation module."]
[null,"was encouraged over all other for rigorous pH calculation with confidence.",null,null,null,null,null,null,null,null,null,null,null,null,null,null,null,"Version 4.1, February 2014 - Titration module now imports Indicator colors from Database; Distribution, Evaluation and Analysis modules import data also from Titration."]
[null,"C. A. Lucy, J. Chem. Educ. 2023, 100, 2418−2422, https://doi.org/10.1021/acs.jchemed.2c01203",null,null,null,null,null,null,null,null,null,null,null,null,null,null,null,"Versions 4.1.1 to 4.1.3, January 2015 minor corrections and improved comments on ionic strength calculations."]
[null,"People from 100+ countries, including 200+ universities and 100+ companies,",null,null,null,null,null,null,null,null,null,null,null,null,null,null,null,"Version 4.2.0, February 2015 - Extended data weighting options in Regression; ionic strength effect correction added to Distribution."]
[null,"downloaded over 200 thousand copies of CurTipot (as tracked by Google Analytics)",null,null,null,null,null,null,null,null,null,null,null,null,null,null,null,"Version 4.2.2, September 2015 - Cells to fill with concentrations of bases protoneted to neutrality are now underlined in green."]
[null,"CurTiPot was used and cited in 300+ papers and thesis",null,null,null,null,null,null,null,null,null,null,null,null,null,null,null,"Version 4.2.3. March 2016 - Indicator colors are loaded in Titration (function unavailable in v. 4.2.2)."]
[null,"http://scholar.google.com/scholar?hl=en-USR&as_sdt=0,5&q=curtipot",null,null,null,null,null,null,null,null,null,null,null,null,null,null,null,"Version 4.3.0, January 2018 - Marker added for (reversible) rejection of outliers in Regression module; Real data loading added to Simulation for interactive curve fitting."]
[null,null,null,null,null,null,null,null,null,null,null,null,null,null,null,null,null,"Version 4.3.1, May 2021 - Modules for users' results saving added ( +pH, +Eva and +Reg); Regression/Simulation data exchange implemented; some instructions/notes were improved."]
[null,null,null,null,null,null,null,null,null,null,null,null,null,null,null,null,null,"Version 4.4.0, January/2024 - batch processing of pH calculations and other parameters introduced to deal with (long) lists of solutions of different composition"]

{"sheet":"   pH_calc   ","index":1,"n_rows":161,"n_cols":33,"rows_kept":161,"cut":false,"hidden":false,"merged":[]}
[null,"             pH Calculator with batch processor",null,null,null,null,null,"↑   Hover  over ↑ red marks for instructions        .",null,null," pKas of the acids and bases in the solution",null,null,"Click on K2 to Q2; select acids/bases; click on J2; read M1",null,null,null," Overall protonation constants = bp = SKp (calculated by the program)",null,null,null,null,null,null,null,"       pKas loaded from the Database "]
["    Aqueous solution composition - reagents added, in mol/L",null,null,null,null," Fill out concentrations; Enter; Click button B20.",null,null,null,null,8,1,6,3,7,2,5,"             pKa(n) = -log Kd(HB-->B) = log Kp(1)",null,null,null,null,null,null,null,null,null,"Click on J2 to use these pKas in the pH calculation"]
["Acid / Base\nProtonation",{"$f":"K3","v":"Phosphoric acid"},{"$f":"L3","v":"Acetic acid"},"HCl","Carbonic acid","Hydroxide ion","Ammonia","EDTA",null,"Acid / Base","Phosphoric acid","Acetic acid","HCl","Carbonic acid","Hydroxide ion","Ammonia","EDTA","Acid / Base",{"$f":"K3","v":"Phosphoric acid"},{"$f":"L3","v":"Acetic acid"},"HCl","Carbonic acid","Hydroxide ion","Ammonia","EDTA","Acid / Base",{"$f":"IF(VLOOKUP(K$2,Database!$B$22:$N$301,2)=\"\",\"\",VLOOKUP(K$2,Database!$B$22:$N$301,2))","v":"Phosphoric acid"},{"$f":"IF(VLOOKUP(L$2,Database!$B$22:$N$301,2)=\"\",\"\",VLOOKUP(L$2,Database!$B$22:$N$301,2))","v":"Acetic acid"},{"$f":"IF(VLOOKUP(M$2,Database!$B$22:$N$301,2)=\"\",\"\",VLOOKUP(M$2,Database!$B$22:$N$301,2))","v":"HCl"},{"$f":"IF(VLOOKUP(N$2,Database!$B$22:$N$301,2)=\"\",\"\",VLOOKUP(N$2,Database!$B$22:$N$301,2))","v":"Carbonic acid"},{"$f":"IF(VLOOKUP(O$2,Database!$B$22:$N$301,2)=\"\",\"\",VLOOKUP(O$2,Database!$B$22:$N$301,2))","v":"Hydroxide ion"},{"$f":"IF(VLOOKUP(P$2,Database!$B$22:$N$301,2)=\"\",\"\",VLOOKUP(P$2,Database!$B$22:$N$301,2))","v":"Ammonia"},{"$f":"IF(VLOOKUP(Q$2,Database!$B$22:$N$301,2)=\"\",\"\",VLOOKUP(Q$2,Database!$B$22:$N$301,2))","v":"EDTA"}]
["[B]",null,null,null,null,null,null,null,null,"Charge of B",-3,-1,-1,-2,-1,0,-4,"Charge of B",{"$f":"IF(K4=\"\",\"\",K4)","v":-3},{"$f":"IF(L4=\"\",\"\",L4)","v":-1},-1,-2,-1,0,-4,"Charge of  B",{"$f":"IF(VLOOKUP(K$2,Database!$B$22:$N$301,3)=\"\",\"\",VLOOKUP(K$2,Database!$B$22:$N$301,3))","v":-3},{"$f":"IF(VLOOKUP(L$2,Database!$B$22:$N$301,3)=\"\",\"\",VLOOKUP(L$2,Database!$B$22:$N$301,3))","v":-1},{"$f":"IF(VLOOKUP(M$2,Database!$B$22:$N$301,3)=\"\",\"\",VLOOKUP(M$2,Database!$B$22:$N$301,3))","v":-1},{"$f":"IF(VLOOKUP(N$2,Database!$B$22:$N$301,3)=\"\",\"\",VLOOKUP(N$2,Database!$B$22:$N$301,3))","v":-2},{"$f":"IF(VLOOKUP(O$2,Database!$B$22:$N$301,3)=\"\",\"\",VLOOKUP(O$2,Database!$B$22:$N$301,3))","v":-1},{"$f":"IF(VLOOKUP(P$2,Database!$B$22:$N$301,3)=\"\",\"\",VLOOKUP(P$2,Database!$B$22:$N$301,3))","v":0},{"$f":"IF(VLOOKUP(Q$2,Database!$B$22:$N$301,3)=\"\",\"\",VLOOKUP(Q$2,Database!$B$22:$N$301,3))","v":-4}]
["[HB]",2.6499999999999999E-2,null,null,null,null,null,null,null,"pKa1",2.1480000000000001,4.7569999999999997,-7,6.3520000000000003,15.744999999999999,9.2439999999999998,-0.21,"bp1",{"$f":"IF(K5=\"\",\"\",IF(K6=\"\",10^K5,(IF(K7=\"\",10^K6,(IF(K8=\"\",10^K7,(IF(K9=\"\",10^K8,(IF(K10=\"\",10^K9,10^K10))))))))))","v":2238721138568.3457},57147.863667186728,9.9999999999999995E-8,21330449131.465843,5559042572704029,1753880501.8417609,107151930523.76077,"pKa1 = logKpn",{"$f":"IF(VLOOKUP(K$2,Database!$B$22:$N$301,4)=\"\",\"\",VLOOKUP(K$2,Database!$B$22:$N$301,4))","v":2.1480000000000001},{"$f":"IF(VLOOKUP(L$2,Database!$B$22:$N$301,4)=\"\",\"\",VLOOKUP(L$2,Database!$B$22:$N$301,4))","v":4.7569999999999997},{"$f":"IF(VLOOKUP(M$2,Database!$B$22:$N$301,4)=\"\",\"\",VLOOKUP(M$2,Database!$B$22:$N$301,4))","v":-7},{"$f":"IF(VLOOKUP(N$2,Database!$B$22:$N$301,4)=\"\",\"\",VLOOKUP(N$2,Database!$B$22:$N$301,4))","v":6.3520000000000003},{"$f":"IF(VLOOKUP(O$2,Database!$B$22:$N$301,4)=\"\",\"\",VLOOKUP(O$2,Database!$B$22:$N$301,4))","v":13.997},{"$f":"IF(VLOOKUP(P$2,Database!$B$22:$N$301,4)=\"\",\"\",VLOOKUP(P$2,Database!$B$22:$N$301,4))","v":9.2439999999999998},{"$f":"IF(VLOOKUP(Q$2,Database!$B$22:$N$301,4)=\"\",\"\",VLOOKUP(Q$2,Database!$B$22:$N$301,4))","v":-0.21}]
["[H2B]",0.02,null,null,null,null,null,null,null,"pKa2",7.1989999999999998,"","",10.329000000000001,"","",1.5,"bp2",{"$f":"IF(K6=\"\",\"\",IF(K7=\"\",S5*10^K5,(IF(K8=\"\",S5*10^K6,(IF(K9=\"\",S5*10^K7,(IF(K10=\"\",S5*10^K8,S5*10^K9))))))))","v":3.539973410834362E+19},"","",4.7973344863669224E+16,"","",6.0255958607435917E+17,"pKa2 = logKpn-1",{"$f":"IF(VLOOKUP(K$2,Database!$B$22:$N$301,5)=\"\",\"\",VLOOKUP(K$2,Database!$B$22:$N$301,5))","v":7.1989999999999998},{"$f":"IF(VLOOKUP(L$2,Database!$B$22:$N$301,5)=\"\",\"\",VLOOKUP(L$2,Database!$B$22:$N$301,5))","v":""},{"$f":"IF(VLOOKUP(M$2,Database!$B$22:$N$301,5)=\"\",\"\",VLOOKUP(M$2,Database!$B$22:$N$301,5))","v":""},{"$f":"IF(VLOOKUP(N$2,Database!$B$22:$N$301,5)=\"\",\"\",VLOOKUP(N$2,Database!$B$22:$N$301,5))","v":10.329000000000001},{"$f":"IF(VLOOKUP(O$2,Database!$B$22:$N$301,5)=\"\",\"\",VLOOKUP(O$2,Database!$B$22:$N$301,5))","v":""},{"$f":"IF(VLOOKUP(P$2,Database!$B$22:$N$301,5)=\"\",\"\",VLOOKUP(P$2,Database!$B$22:$N$301,5))","v":""},{"$f":"IF(VLOOKUP(Q$2,Database!$B$22:$N$301,5)=\"\",\"\",VLOOKUP(Q$2,Database!$B$22:$N$301,5))","v":1.5}]
["[H3B]",null,null,null,null,null,null,null,null,"pKa3",12.35,"","","","","",2.21,"bp3",{"$f":"IF(K7=\"\",\"\",IF(K8=\"\",S6*10^K5,(IF(K9=\"\",S6*10^K6,(IF(K10=\"\",S6*10^K7,S6*10^K8))))))","v":4.9773708497893867E+21},"","","","","",7.7624711662869401E+20,"pKa3 = logKpn-2",{"$f":"IF(VLOOKUP(K$2,Database!$B$22:$N$301,6)=\"\",\"\",VLOOKUP(K$2,Database!$B$22:$N$301,6))","v":12.35},{"$f":"IF(VLOOKUP(L$2,Database!$B$22:$N$301,6)=\"\",\"\",VLOOKUP(L$2,Database!$B$22:$N$301,6))","v":""},{"$f":"IF(VLOOKUP(M$2,Database!$B$22:$N$301,6)=\"\",\"\",VLOOKUP(M$2,Database!$B$22:$N$301,6))","v":""},{"$f":"IF(VLOOKUP(N$2,Database!$B$22:$N$301,6)=\"\",\"\",VLOOKUP(N$2,Database!$B$22:$N$301,6))","v":""},{"$f":"IF(VLOOKUP(O$2,Database!$B$22:$N$301,6)=\"\",\"\",VLOOKUP(O$2,Database!$B$22:$N$301,6))","v":""},{"$f":"IF(VLOOKUP(P$2,Database!$B$22:$N$301,6)=\"\",\"\",VLOOKUP(P$2,Database!$B$22:$N$301,6))","v":""},{"$f":"IF(VLOOKUP(Q$2,Database!$B$22:$N$301,6)=\"\",\"\",VLOOKUP(Q$2,Database!$B$22:$N$301,6))","v":2.21}]
["[H4B]",null,null,null,null,null,null,null,null,"pKa4","","","","","","",3.11,"bp4",{"$f":"IF(K8=\"\",\"\",IF(K9=\"\",S7*10^K5,(IF(K10=\"\",S7*10^K6,S7*10^K7))))","v":""},"","","","","",1.2589254117941712E+23,"pKa4 = logKpn-3",{"$f":"IF(VLOOKUP(K$2,Database!$B$22:$N$301,7)=\"\",\"\",VLOOKUP(K$2,Database!$B$22:$N$301,7))","v":""},{"$f":"IF(VLOOKUP(L$2,Database!$B$22:$N$301,7)=\"\",\"\",VLOOKUP(L$2,Database!$B$22:$N$301,7))","v":""},{"$f":"IF(VLOOKUP(M$2,Database!$B$22:$N$301,7)=\"\",\"\",VLOOKUP(M$2,Database!$B$22:$N$301,7))","v":""},{"$f":"IF(VLOOKUP(N$2,Database!$B$22:$N$301,7)=\"\",\"\",VLOOKUP(N$2,Database!$B$22:$N$301,7))","v":""},{"$f":"IF(VLOOKUP(O$2,Database!$B$22:$N$301,7)=\"\",\"\",VLOOKUP(O$2,Database!$B$22:$N$301,7))","v":""},{"$f":"IF(VLOOKUP(P$2,Database!$B$22:$N$301,7)=\"\",\"\",VLOOKUP(P$2,Database!$B$22:$N$301,7))","v":""},{"$f":"IF(VLOOKUP(Q$2,Database!$B$22:$N$301,7)=\"\",\"\",VLOOKUP(Q$2,Database!$B$22:$N$301,7))","v":3.11}]
["[H5B]",null,null,null,null,null,null,null,"Total","pKa5","","","","","","",6.75,"bp5",{"$f":"IF(K9=\"\",\"\",IF(K10=\"\",S8*10^K5,S8*10^K6))","v":""},"","","","","",3.9810717055349867E+24,"pKa5 = logKpn-4",{"$f":"IF(VLOOKUP(K$2,Database!$B$22:$N$301,8)=\"\",\"\",VLOOKUP(K$2,Database!$B$22:$N$301,8))","v":""},{"$f":"IF(VLOOKUP(L$2,Database!$B$22:$N$301,8)=\"\",\"\",VLOOKUP(L$2,Database!$B$22:$N$301,8))","v":""},{"$f":"IF(VLOOKUP(M$2,Database!$B$22:$N$301,8)=\"\",\"\",VLOOKUP(M$2,Database!$B$22:$N$301,8))","v":""},{"$f":"IF(VLOOKUP(N$2,Database!$B$22:$N$301,8)=\"\",\"\",VLOOKUP(N$2,Database!$B$22:$N$301,8))","v":""},{"$f":"IF(VLOOKUP(O$2,Database!$B$22:$N$301,8)=\"\",\"\",VLOOKUP(O$2,Database!$B$22:$N$301,8))","v":""},{"$f":"IF(VLOOKUP(P$2,Database!$B$22:$N$301,8)=\"\",\"\",VLOOKUP(P$2,Database!$B$22:$N$301,8))","v":""},{"$f":"IF(VLOOKUP(Q$2,Database!$B$22:$N$301,8)=\"\",\"\",VLOOKUP(Q$2,Database!$B$22:$N$301,8))","v":6.75}]
["[H6B]",null,null,null,null,null,null,null,"SS","pKa6","","","","","","",11.03,"bp6",{"$f":"IF(K10=\"\",\"\",S9*10^K5)","v":""},"","","","","",2.4547089156850394E+24,"pKa6 = logKpn-5",{"$f":"IF(VLOOKUP(K$2,Database!$B$22:$N$301,9)=\"\",\"\",VLOOKUP(K$2,Database!$B$22:$N$301,9))","v":""},{"$f":"IF(VLOOKUP(L$2,Database!$B$22:$N$301,9)=\"\",\"\",VLOOKUP(L$2,Database!$B$22:$N$301,9))","v":""},{"$f":"IF(VLOOKUP(M$2,Database!$B$22:$N$301,9)=\"\",\"\",VLOOKUP(M$2,Database!$B$22:$N$301,9))","v":""},{"$f":"IF(VLOOKUP(N$2,Database!$B$22:$N$301,9)=\"\",\"\",VLOOKUP(N$2,Database!$B$22:$N$301,9))","v":""},{"$f":"IF(VLOOKUP(O$2,Database!$B$22:$N$301,9)=\"\",\"\",VLOOKUP(O$2,Database!$B$22:$N$301,9))","v":""},{"$f":"IF(VLOOKUP(P$2,Database!$B$22:$N$301,9)=\"\",\"\",VLOOKUP(P$2,Database!$B$22:$N$301,9))","v":""},{"$f":"IF(VLOOKUP(Q$2,Database!$B$22:$N$301,9)=\"\",\"\",VLOOKUP(Q$2,Database!$B$22:$N$301,9))","v":11.03}]
["S[HiB]",{"$f":"SUM(B4:B10)","v":4.65E-2},{"$f":"SUM(C4:C10)","v":0},0,0,0,0,0,{"$f":"SUM(B11:H11)","v":4.65E-2},"Electrolyte","Na+","K+","Ca++","Cl-","NO3-","SO4=","ClO4-","Kw",{"$f":"10^-K13","v":1.0069316688518014E-14},null,null,null,null,null,null,"Temperature",{"$f":"IF(VLOOKUP(K$2,Database!$B$22:$N$301,10)=\"\",\"unknown\",VLOOKUP(K$2,Database!$B$22:$N$301,10))","v":25},{"$f":"IF(VLOOKUP(L$2,Database!$B$22:$N$301,10)=\"\",\"unknown\",VLOOKUP(L$2,Database!$B$22:$N$301,10))","v":25},{"$f":"IF(VLOOKUP(M$2,Database!$B$22:$N$301,10)=\"\",\"unknown\",VLOOKUP(M$2,Database!$B$22:$N$301,10))","v":25},{"$f":"IF(VLOOKUP(N$2,Database!$B$22:$N$301,10)=\"\",\"unknown\",VLOOKUP(N$2,Database!$B$22:$N$301,10))","v":25},{"$f":"IF(VLOOKUP(O$2,Database!$B$22:$N$301,10)=\"\",\"unknown\",VLOOKUP(O$2,Database!$B$22:$N$301,10))","v":25},{"$f":"IF(VLOOKUP(P$2,Database!$B$22:$N$301,10)=\"\",\"unknown\",VLOOKUP(P$2,Database!$B$22:$N$301,10))","v":25},{"$f":"IF(VLOOKUP(Q$2,Database!$B$22:$N$301,10)=\"\",\"unknown\",VLOOKUP(Q$2,Database!$B$22:$N$301,10))","v":25}]
["S[H]",{"$f":"B5+2*B6+3*B7+4*B8+5*B9+6*B10","v":6.6500000000000004E-2},{"$f":"C5+2*C6+3*C7+4*C8+5*C9+6*C10","v":0},{"$f":"D5+2*D6+3*D7+4*D8+5*D9+6*D10","v":0},0,{"$f":"F5+2*F6+3*F7+4*F8+5*F9+6*F10","v":0},0,0,{"$f":"SUM(B12:H12)","v":6.6500000000000004E-2},"Ion charge",1,1,2,-1,-1,-2,-1,null,null,null,null,null,null,null,null,"Ionic strength",{"$f":"IF(VLOOKUP(K$2,Database!$B$22:$N$301,11)=\"\",\"unknown\",VLOOKUP(K$2,Database!$B$22:$N$301,11))","v":0},{"$f":"IF(VLOOKUP(L$2,Database!$B$22:$N$301,11)=\"\",\"unknown\",VLOOKUP(L$2,Database!$B$22:$N$301,11))","v":0},{"$f":"IF(VLOOKUP(M$2,Database!$B$22:$N$301,11)=\"\",\"unknown\",VLOOKUP(M$2,Database!$B$22:$N$301,11))","v":0},{"$f":"IF(VLOOKUP(N$2,Database!$B$22:$N$301,11)=\"\",\"unknown\",VLOOKUP(N$2,Database!$B$22:$N$301,11))","v":0},{"$f":"IF(VLOOKUP(O$2,Database!$B$22:$N$301,11)=\"\",\"unknown\",VLOOKUP(O$2,Database!$B$22:$N$301,11))","v":0},{"$f":"IF(VLOOKUP(P$2,Database!$B$22:$N$301,11)=\"\",\"unknown\",VLOOKUP(P$2,Database!$B$22:$N$301,11))","v":0},{"$f":"IF(VLOOKUP(Q$2,Database!$B$22:$N$301,11)=\"\",\"unknown\",VLOOKUP(Q$2,Database!$B$22:$N$301,11))","v":0}]
["SziCi",{"$f":"K4*B4+(K4+1)*B5+(K4+2)*B6+(K4+3)*B7+(K4+4)*B8+(K4+5)*B9+(K4+6)*B10","v":-7.2999999999999995E-2},0,{"$f":"M4*D4+(M4+1)*D5+(M4+2)*D6+(M4+3)*D7+(M4+4)*D8+(M4+5)*D9+(M4+6)*D10","v":0},0,{"$f":"O4*F4+(O4+1)*F5+(O4+2)*F6+(O4+3)*F7+(O4+4)*F8+(O4+5)*F9+(O4+6)*F10","v":0},0,0,{"$f":"SUM(B13:H13)","v":-7.2999999999999995E-2},"pKw",13.997]
["Electrolyte",{"$f":"K11","v":"Na+"},{"$f":"L11","v":"K+"},"Ca++","Cl-","NO3-","SO4=","ClO4-",null," Davies equation parameters",null,null,null,"Color  coding"]
["Ci (mol/L)",7.2999999999999995E-2,null,null,0,null,null,null,null," for activity coefficient estimation",null,null,null,"D  o     n  o  t     c  h  a  n  g  e "]
["ziCi",{"$f":"B15*K12","v":7.2999999999999995E-2},0,0,0,0,0,0,{"$f":"SUM(B16:H16)","v":7.2999999999999995E-2},"A ",0.50900000000000001,null,null," C h a n g e   c r i t e r i o u s l y"]
["Charge Balance",{"$f":"IF(I17=0,\"OK\", \"WARNING\")","v":"OK"},{"$f":"IF(I17<0,\"Add cations/Remove anions\", \"\")","v":""},null,{"$f":"IF(I17>0,\"Add anions/Remove cations\", \"\")","v":""},null,null,{"$f":"IF(I17=0,\"\",\"Unbalance\")","v":""},{"$f":"I13+I16","v":0},"b",0.3,null,null,"Fill out, change or leave blank"]
[]
[]
[]
[]
["  Results at chemical equilibrium",null,null,null,null,null,null,null,null,"   Stepwise apparent constants recalculated for I ",null,null,{"$f":"E26","v":9.9500751631900794E-2},null,null,null,null,"    Overall apparent protonation constants recalculated for I",null,null,null,null,{"$f":"$E$26","v":9.9500751631900794E-2},null,null,null,"How to enable Excel files with macros and use CurTiPot"]
["pH",7.0006187684125587,"a H+",9.9857625749919981E-8,"a OH-",1.0083660217604355E-7,"pOH",6.9963817968815158,null,"Acid / Base",{"$f":"K3","v":"Phosphoric acid"},{"$f":"L3","v":"Acetic acid"},"HCl","Carbonic acid","Hydroxide ion","Ammonia","EDTA","Acid / Base",{"$f":"K3","v":"Phosphoric acid"},{"$f":"L3","v":"Acetic acid"},"HCl","Carbonic acid","Hydroxide ion","Ammonia","EDTA",null,"Office for Windows"]
["p[H]",6.8937560664612372,"[H+]",1.2771559574483629E-7,"[OH-]",1.2896768525251226E-7,"p[OH]",6.8895190949301943,null,"Charge of B",{"$f":"K4","v":-3},-1,-1,-2,-1,0,-4,"Charge of B",{"$f":"K4","v":-3},-1,-1,-2,-1,0,-4,null,"1. Download CurTiPot from the author's website to the folder of your preference"]
["\"pH\"",7.3212041687220335,"\"[H+]\"",4.7730483233537674E-8,"\"[OH-]\"",2.1096169365511593E-7,"\"pOH\"",6.6757963965720428,null,"pK'an = logK'p1",11.708824287069081,4.5432747882173761,-7.2137256866102613,9.9015496093499973,15.531275231987562,9.2440003733356022,10.175098829855859,"b'p1",511474297107.32587,34936.114697246194,6.1132844616387423E-8,7971668116.1916504,3398400858129980.5,1753880501.8417609,14965747683.434774,null,"2. Open the folder and right-click on the file curtipot_.xlsm"]
["g H+",0.78187495558041398,"    Ionic strength (mol/L)     ",null,9.9500751631900794E-2,null,"g OH-",0.78187495558041398,null,"pK'an-1 = logK'p2",6.7715494829393048,null,null,6.1382748526343276,null,null,6.1088240609029878,"b'p2",3.0225467276524339E+18,null,null,1.0960334639857812E+16,null,null,1.9227474015170404E+16,null,"3. Select \"Properties\" in the pop-up window"]
["   Buffer Capacity (Buffer Index, DC/DpH)",null,null,"mol.L-1.pH-1",2.6247987914089322E-2,"     Buffer Strength",null,1.139935677253579E-2,null,"pK'an-2 = logK'p3",1.9342746828482089,null,null,null,null,null,2.6825493177976694,"b'p3",2.5980507386339344E+20,null,null,null,null,null,9.2570251268758241E+18,null,"4. Check the \"unlock\" key (usually near the bottom right corner)"]
[" Mean charge (zm) and mean protonation (hm) of the equilibrium HiB  species at pH",null,null,null,null,null,{"$f":"B23","v":7.0006187684125587},null,null,"pK'an-3 = logK'p4",null,null,null,null,null,null,1.9962746853521902,"b'p4",null,null,null,null,null,null,9.1779576056055202E+20,null,"5. Click OK"]
["Acid / Base",{"$f":"K3","v":"Phosphoric acid"},"Acetic acid","HCl","Carbonic acid","Hydroxide ion","Ammonia","EDTA",null,"pK'an-4 = logK'p5",null,null,null,null,null,null,1.500000060580204,"b'p5",null,null,null,null,null,null,2.9023250302178821E+22,null,"6. Double click the curtipot_.xlsm file to open it"]
["zm",-1.569892445341402,-0.99555793329678188,-0.99999999999999223,-0.85159071312404988,-2.3039946617231521E-9,0.99555551393853325,-2.8595405669276062,null,"pK'an-5 = logK'p6",null,null,null,null,null,null,3.725395421414722E-3,"b'p6",null,null,null,null,null,null,2.9273283758336799E+22,null,"7. Select \"Enable content\""]
["hm",1.430107554658598,4.4420667032181579E-3,7.8076176697583672E-15,1.1484092868759501,0.99999999769600534,0.99555551393853325,1.1404594330723938,null,"pK'w",13.783275161391431,null,null,null,null,null,null,"K'w",1.6471205866017897E-14,null,null,null,null,null,null,null,"8. Read the front page of CurTiPot "]
[" Equilibrium concentration of species, in mol/L",null,null,null,null,null,null,null,null," Activity coefficient (g) of species",null,null,null,"for pH ",{"$f":"B23","v":7.0006187684125587},"and I ",{"$f":"E26","v":9.9500751631900794E-2},null,null,null,null,null,null,null,null,null,"9. Use the program"]
["Acid / Base protonation",{"$f":"K3","v":"Phosphoric acid"},"Acetic acid","HCl","Carbonic acid","Hydroxide ion","Ammonia","EDTA","[H+]","Acid / Base  protonation",{"$f":"K3","v":"Phosphoric acid"},"Acetic acid","HCl","Carbonic acid","Hydroxide ion","Ammonia","EDTA",null,null,null,null,null,null,null,null,null,"10. Save your data, settings and results as Curtipot_anyname.xlsm"]
["[B]",4.0566581025196753E-7,null,null,null,null,null,null,{"$f":"D24","v":1.2771559574483629E-7},"g B",0.10920328964692329,0.78187495558041398,0.78187495558041398,0.37372246908913692,0.78187495558041398,1,1.9507285395505836E-2,null,null,null,null,null,null,null,null,null,"11.  All macros are fully removed when closing the file"]
["[HB]",2.649940693403156E-2,null,null,null,null,null,null,null,"g HB",0.37372246908913692,1,1,0.78187495558041398,1,0.78187495558041398,0.10920328964692329]
["[H2B]",1.9999967842881328E-2,null,null,null,null,null,null,"[OH-]","g H2B",0.78187495558041398,null,null,1,null,null,0.37372246908913692,null,null,null,null,null,null,null,null,null,"Former Office and Excel version"]
["[H3B]",2.1955727686129842E-7,null,null,null,null,null,null,{"$f":"F24","v":1.2896768525251226E-7},"g H3B",1,null,null,null,null,null,0.78187495558041398,null,null,null,null,null,null,null,null,null,"1. Open a new blank Excel spreadsheet "]
["[H4B]",null,null,null,null,null,null,null,null,"g H4B",null,null,null,null,null,null,1,null,null,null,null,null,null,null,null,null,"2. Click on the File tab (or the Office button, in Windows XP)(top left corner)"]
["[H5B]",null,null,null,null,null,null,null,null,"g H5B",null,null,null,null,null,null,0.78187495558041398,null,null,null,null,null,null,null,null,null,"3. Click on \"Options\" (bottom left)"]
["[H6B]",null,null,null,null,null,null,null,"SS","g H6B",null,null,null,null,null,null,0.37372246908913692,null,null,null,null,null,null,null,null,null,"4. Click on \"Trust Center\" (bottom left)"]
["S[HiB]",{"$f":"B34+B35+B36+B37+B38+B39+B40","v":4.65E-2},{"$f":"C34+C35+C36+C37+C38+C39+C40","v":0},0,0,0,0,0,{"$f":"SUM(B41:H41)","v":4.65E-2},null,null,null,null,null,null,null,null,null,null,null,null,null,null,null,null,null,"5. Click on \"Trust Center Settings\" (bottom right)"]
[" Species distribution (fractional composition, in %)",null,null,null,"for pH",{"$f":"B23","v":7.0006187684125587},"or p[H]=",{"$f":"$B$24","v":6.8937560664612372},null,"Electrolyte",{"$f":"K11","v":"Na+"},"K+","Ca++","Cl-","NO3-","SO4=","ClO4-",null,null,null,null,null,null,null,null,null,"6. Click on \"Macro Settings\""]
["Acid / Base protonation",{"$f":"K3","v":"Phosphoric acid"},"Acetic acid","HCl","Carbonic acid","Hydroxide ion","Ammonia","EDTA",null,"gi",0.78187495558041398,0.78187495558041398,0.37372246908913692,0.78187495558041398,0.78187495558041398,0.37372246908913692,0.78187495558041398,null,null,null,null,null,null,null,null,null,"7. Click on \"Disable macros with notification\""]
["% B",8.7239959193971517E-4,99.555793329678181,99.999999999999218,8.3480582132646336E-2,2.303994620474108E-7,0.44444860614667686,4.4923564218738013E-2,null,null,null,null,null,null,null,null,null,null,null,null,null,null,null,null,null,null,"8. Click OK; follow steps 1 to 8 only once on each computer"]
["% HB",56.98797190114314,0.44420667032181577,7.8076176697583674E-13,84.992110148139702,99.999999769600535,99.555551393853321,85.865075904483774,null,null,null,null,null,null,null,null,null,null,null,null,null,null,null,null,null,null,"9. Open the CurTiPot file"]
["% H2B",43.010683533078122,null,null,14.924409269727654,null,null,14.089134202106679,null,null,null,null,null,null,null,null,null,null,null,null,null,null,null,null,null,null,"10. When the \"Security warning\" shows up, click on it to enable content"]
["% H3B",4.7216618679849122E-4,null,null,null,null,null,8.6631822104069815E-4,null,null,null,null,null,null,null,null,null,null,null,null,null,null,null,null,null,null,"11. Follow the steps 8 to 11 above"]
["% H4B",null,null,null,null,null,null,1.0969731233323473E-8]
["% H5B",null,null,null,null,null,null,4.4303692154282471E-14,null,null,null,null,null,null,null,null,null,null,null,null,null,null,null,null,null,null,"Old versions of Office and Excel: "]
["% H6B",null,null,null,null,null,null,5.7070180944934333E-21,null,null,null,null,null,null,null,null,null,null,null,null,null,null,null,null,null,null,"1. Open a new blank Excel spreadsheet "]
["% S[HiB]",{"$f":"B44+B45+B46+B47+B48+B49+B50","v":100},{"$f":"C44+C45+C46+C47+C48+C49+C50","v":100},100,100,100,100,100,null,null,null,null,null,null,null,null,null,null,null,null,null,null,null,null,null,null,"2. Click on the \"Tools\" tab"]
[null,null,null,null,null,null,null,null,null,null,null,null,null,null,null,null,null,null,null,null,null,null,null,null,null,null,"3. Select \"Macro\""]
[null,null,null,null,null,null,null,null,null,null,null,null,null,null,null,null,null,null,null,null,null,null,null,null,null,null,"4. Select \"Security\""]
[null,null,null,null,null,null,null,null,null,null,null,null,null,null,null,null,null,null,null,null,null,null,null,null,null,null,"5. Select \"Security level\""]
[null,null,null,null,null,null,null,null,null,null,null,null,null,null,null,null,null,null,null,null,null,null,null,null,null,null,"6. Select \"Medium\""]
[null,null,null,null,null,null,null,null,null,null,null,null,null,null,null,null,null,null,null,null,null,null,null,null,null,null,"7. Open the CurTiPot file and enable the content"]
[null,"Batch pH Calculator"]
["Sample ID","  Species added to the solution, in mol/L",null,null,null,null,null,"Calculated pH and other parameters"]
["Cell ID .","B5","B6","D5","G4","E6",null,"B23","E26","K35","K36","B45","E27"]
["Species .","HPO4=","H2PO4-","HCl","NH4OH","CO2","log HB/H2B","pH","I","g HPO4=","g H2PO4-","% HPO4=","buff. cap."]
["mix. ratio 1",0.01,0.04,null,null,null,{"$f":"LOG10(B61/C61)","v":-0.6020599913279624},6.2936061420633633,8.3003553082661399E-2,0.39383748975787858,0.79218983175513413,20.005653138797719,1.843363257800508E-2]
[2,{"$f":"B61+0.001","v":1.0999999999999999E-2},{"$f":"C61-0.001","v":3.9E-2},null,null,null,-0.54967192186827418,6.3448296532594348,8.4003110798025638E-2,0.39247151570866196,0.79150203471330238,22.004869381950932,1.9767454485428524E-2]
[3,{"$f":"B62+0.001","v":1.2E-2},{"$f":"C62-0.001","v":3.7999999999999999E-2},null,null,null,-0.50060235056918523,6.3927559133775702,8.5002745372725397E-2,0.39112656605138996,0.79082306751931808,24.004210094918911,2.1009474711239887E-2]
[4,1.3000000000000001E-2,3.6999999999999998E-2,null,null,null,-0.45425837176015815,6.4379753138848006,8.6002439385612528E-2,0.38980217629745922,0.79015276626011177,26.003645320516195,2.2159625473890235E-2]
[5,1.4000000000000002E-2,3.5999999999999997E-2,null,null,null,-0.41017446508904915,6.4809516421812887,8.70021804041822E-2,0.38849789035047894,0.78949096850981793,28.003153500308713,2.3217858495545585E-2]
[6,1.5000000000000003E-2,3.4999999999999996E-2,null,null,null,-0.36797678529459427,6.5220574919636967,8.800195930447019E-2,0.38721326250738364,0.78883751443577454,30.00271861887861,2.4184138515582692E-2]
[7,1.6000000000000004E-2,3.3999999999999996E-2,null,null,null,-0.32735893438633018,6.5615983202731867,8.9001769293751989E-2,0.38594785838479717,0.78819224736964355,32.002328539417498,2.5058439299339749E-2]
[8,1.7000000000000005E-2,3.2999999999999995E-2,null,null,null,-0.28806501849961336,6.5998292851203946,9.0001605206344773E-2,0.38470125540936823,0.78755501416070983,34.001973795092212,2.5840740988791862E-2]
[9,1.8000000000000006E-2,3.1999999999999994E-2,null,null,null,-0.24987747321659964,6.6369673562728648,9.100146310407356E-2,0.38347304287638256,0.78692566530959485,36.001646881216956,2.6531028385410858E-2]
[10,1.9000000000000006E-2,3.0999999999999993E-2,null,null,null,-0.21260809288144347,6.673200243526666,9.2001339920416883E-2,0.38226282193322625,0.786304055061958,38.001341701079014,2.7129289747243997E-2]
[11,2.0000000000000007E-2,2.9999999999999992E-2,null,null,null,-0.17609125905568099,6.7086931323578582,9.3001233001230907E-2,0.38107020566931438,0.78569004155516076,40.00105273087086,2.7635515854186225E-2]
[12,2.1000000000000008E-2,2.8999999999999991E-2,null,null,null,-0.14017870316503647,6.7435939217343854,9.4001140609828338E-2,0.37989481805561276,0.78508348636944358,42.000775839210789,2.8049699728525741E-2]
[13,2.2000000000000009E-2,2.799999999999999E-2,null,null,null,-0.10473535052001262,6.778037350223113,9.5001061298464556E-2,0.37873629426196154,0.78448425478324935,44.00050716378724,2.8371835942893917E-2]
[14,2.300000000000001E-2,2.6999999999999989E-2,null,null,null,-6.9635928141394091E-2,6.8121483783649541,9.6000993708436802E-2,0.37759428044592147,0.78389221575490553,46.000242914272413,2.8601920380946461E-2]
[15,2.4000000000000011E-2,2.5999999999999988E-2,null,null,null,-3.4762106259211549E-2,6.8450832331827538,9.8000939196849116E-2,0.3753583640843009,0.78272917977619805,47.999980882814938,2.8739955631235516E-2]
[16,2.5000000000000012E-2,2.4999999999999988E-2,null,null,null,3.8573098662131469E-16,6.8779491359623215,0.10000089475956316,0.37318452516162931,0.78159344179321244,49.999716143249366,2.8785933565184114E-2]
[17,2.6000000000000013E-2,2.3999999999999987E-2,null,null,null,3.4762106259212354E-2,6.9108563406756716,0.10200085954814506,0.37107027770429574,0.78048406812188764,51.999444900634096,2.8739853392199331E-2]
[18,2.7000000000000014E-2,2.2999999999999986E-2,null,null,null,6.9635928141394882E-2,6.9439151903412428,0.10400083376812447,0.36901327614363427,0.7794001729158172,53.999164387936752,2.8601715177749131E-2]
[19,2.8000000000000014E-2,2.1999999999999985E-2,null,null,null,0.10473535052001351,6.977238247712422,0.10600081731503497,0.36701130641748086,0.77834091559470708,55.998870956670501,2.837151983594962E-2]
[20,2.9000000000000015E-2,2.0999999999999984E-2,null,null,null,0.14017870316503736,7.0109425671711456,0.10800080997692327,0.36506227626946802,0.77730549765764656,57.998560249337885,2.8049269276226654E-2]
[21,3.0000000000000016E-2,1.9999999999999983E-2,null,null,null,0.17609125905568182,7.045152205025345,0.1100008124038066,0.36316420570000241,0.77629315938754651,59.998228277317509,2.7634966302633637E-2]
[22,3.1000000000000017E-2,1.8999999999999982E-2,null,null,null,0.21260809288144436,7.080001042644354,0.11200082498656047,0.36131522021452461,0.77530317787673864,61.997869730216017,2.7128614988338733E-2]
[23,3.2000000000000015E-2,1.7999999999999981E-2,null,null,null,0.24987747321660053,7.1156361802964883,0.11400084844342927,0.3595135430571979,0.77433486436881926,63.997478513820759,2.6530220807112207E-2]
[24,3.3000000000000015E-2,1.699999999999998E-2,null,null,null,0.28806501849961424,7.1522220783829971,0.11600088386351096,0.35775748860211498,0.77338756208240766,65.997047401149601,2.5839790952089586E-2]
[25,3.4000000000000016E-2,1.599999999999998E-2,null,null,null,0.32735893438633107,7.189945772923787,0.11800093266056222,0.35604545636687096,0.77246064424871463,67.996567435420332,2.5057334864971158E-2]
[26,3.5000000000000017E-2,1.4999999999999979E-2,null,null,null,0.36797678529459527,7.229023625557196,0.12000099669204013,0.35437592537205587,0.77155351222614188,69.996027568208106,2.4182864836737327E-2]
[27,3.6000000000000018E-2,1.3999999999999978E-2,null,null,null,0.41017446508905014,7.2697102521537635,0.12200107852583726,0.35274744883819825,0.77066559369659915,71.995413597767566,2.3216397083675667E-2]
[28,3.7000000000000019E-2,1.2999999999999977E-2,null,null,null,0.45425837176015921,7.3123106488284773,0.12400118163519676,0.35115864936935548,0.76979634103404482,73.994707336005064,2.2157953021417431E-2]
[29,3.800000000000002E-2,1.1999999999999976E-2,null,null,null,0.50060235056918645,7.357197028697029,0.12600131025954539,0.3496082147741954,0.76894522993840397,75.993884012475448,2.1007561872330421E-2]
[30,3.9000000000000021E-2,1.0999999999999975E-2,null,null,null,0.5496719218682754,7.4048329375343771,0.12800147106320345,0.3480948928529668,0.76811175742428195,77.992911045863877,1.9765263186527753E-2]
[31,4.0000000000000022E-2,9.9999999999999742E-3,null,null,null,0.60205999132796373,7.4558086834132817,0.1300016729117312,0.34661748803147097,0.76729544074922473,79.991742269774207,1.8431112972624328E-2]
["pH7 reference",2.6499999999999999E-2,0.02,0,null,null,null,7.0006187684125587,9.9500751631900794E-2,0.37372246908913692,0.78187495558041398,56.98797190114314,2.6247987914089322E-2]
["HCl add. 1",2.6499999999999999E-2,0.02,{"$f":"D92+0.001","v":1E-3},null,null,null,6.9636745977842249,9.8500767961440361E-2,0.37480935848937758,0.78244281437424501,54.837757686190102,2.6520255719215253E-2]
[2,2.6499999999999999E-2,0.02,{"$f":"D93+0.001","v":2E-3},null,null,null,6.9270582424009959,9.7500790421509387E-2,0.37591160223040754,0.78301743531024037,52.687522093170521,2.6693538907974258E-2]
[3,2.6499999999999999E-2,0.02,3.0000000000000001E-3,null,null,null,6.8906268497554173,9.6500830690573941E-2,0.37702950709139643,0.78359893140482639,50.537285804238365,2.6767835296374894E-2]
[4,2.6499999999999999E-2,0.02,4.0000000000000001E-3,null,null,null,6.8542409558175024,9.5500877394575481E-2,0.37816341516035851,0.78418743230581289,48.387036917835111,2.6743145666975495E-2]
[5,2.6499999999999999E-2,0.02,5.0000000000000001E-3,null,null,null,6.8177622416827761,9.4500935143182252E-2,0.37931366086422424,0.78478306183968538,46.236785156241375,2.6619470679663523E-2]
[6,2.6499999999999999E-2,0.02,6.0000000000000001E-3,null,null,null,6.7810499703782376,9.3501004677205443E-2,0.38048059340864182,0.78538594961491082,44.086534535548196,2.639681245300211E-2]
[7,2.6499999999999999E-2,0.02,7.0000000000000001E-3,null,null,null,6.7439578423192623,9.2501086864954965E-2,0.38166457276251825,0.78599622884452092,41.936288953757568,2.6075174301963173E-2]
[8,2.6499999999999999E-2,0.02,8.0000000000000002E-3,null,null,null,6.706330452787947,9.1501183342152195E-2,0.3828659693258547,0.78661403608755842,39.786053189981615,2.565456104697476E-2]
[9,2.6499999999999999E-2,0.02,9.0000000000000011E-3,null,null,null,6.6679991733858239,9.0501295902423409E-2,0.38408516508615287,0.78723951175415174,37.63583217180684,2.5134979183403877E-2]
[10,2.6499999999999999E-2,0.02,1.0000000000000002E-2,null,null,null,6.6287772160787695,8.9501426698640502E-2,0.38532255385179726,0.78787280012866856,35.485631319939003,2.4516437243760115E-2]
[11,2.6499999999999999E-2,0.02,1.1000000000000003E-2,null,null,null,6.5884534935616585,8.8501579328233784E-2,0.38657854036954414,0.78851404882036413,33.335458119418881,2.3798946779721674E-2]
[12,2.6499999999999999E-2,0.02,1.2000000000000004E-2,null,null,null,6.5467846331604473,8.7501757249206599E-2,0.38785354277231898,0.78916340991294476,31.185320142290923,2.298252247767266E-2]
[13,2.6499999999999999E-2,0.02,1.3000000000000005E-2,null,null,null,6.5034844782677048,8.6501965814426568E-2,0.38914799051434318,0.78982103880410037,29.035227928924023,2.2067184103624637E-2]
[14,2.6499999999999999E-2,0.02,1.4000000000000005E-2,null,null,null,6.4582096843886241,8.5502211882200529E-2,0.39046232530353497,0.79048709457581967,26.885194712819089,2.1052957985913265E-2]
[15,2.6499999999999999E-2,0.02,1.5000000000000006E-2,null,null,null,6.4105395390979032,8.4502504825254315E-2,0.39179700022097497,0.79116173944052559,24.735238145972126,1.9939879992092003E-2]
[16,2.6499999999999999E-2,0.02,1.6000000000000007E-2,null,null,null,6.3599467655677779,8.3502857628305699E-2,0.39315247861569019,0.79184513807908308,22.585382291705997,1.8727999952156904E-2]
[17,2.6499999999999999E-2,0.02,1.7000000000000008E-2,null,null,null,6.3057538873900709,8.250328885640118E-2,0.39452923166626935,0.79253745631629391,20.435661196005821,1.7417389041197349E-2]
[18,2.6499999999999999E-2,0.02,1.8000000000000009E-2,null,null,null,6.2470654688372775,8.150382555070293E-2,0.39592773438313017,0.79323885903330915,18.286124179525387,1.6008151884198123E-2]
[19,2.6499999999999999E-2,0.02,1.900000000000001E-2,null,null,null,6.1826581603697761,8.0504509459306442E-2,0.39734845643160632,0.79394950552408328,16.136846962408306,1.4500449304913607E-2]
[20,2.6499999999999999E-2,0.02,2.0000000000000011E-2,null,null,null,6.1107922512989337,7.9505407887979815E-2,0.39879184532617262,0.79466954112579891,13.987951298043916,1.2894540970361999E-2]
[21,2.6499999999999999E-2,0.02,2.1000000000000012E-2,null,null,null,6.0288662135330169,7.8506636920535444E-2,0.40025828967427451,0.79539907907757623,11.839646822028111,1.1190874845236915E-2]
[22,2.6499999999999999E-2,0.02,2.2000000000000013E-2,null,null,null,5.932725590900227,7.7508415198301719E-2,0.40174803284011162,0.79613815812603339,9.6923279844555559,9.3902947924946484E-3]
[23,2.6499999999999999E-2,0.02,2.3000000000000013E-2,null,null,null,5.8151072091051219,7.6511208728014465E-2,0.40326093885374531,0.79688662787093945,7.5468350659165022,7.4945996035418747E-3]
[24,2.6499999999999999E-2,0.02,2.4000000000000014E-2,null,null,null,5.6614885067595377,7.5516215741722584E-2,0.40479570616138966,0.79764376410965543,5.4053280615206942,5.5084146040096866E-3]
[25,2.6499999999999999E-2,0.02,2.5000000000000015E-2,null,null,null,5.4355900462654816,7.4527696658083301E-2,0.40634608463358096,0.79840641889373187,3.2754860134402075,3.4481868637868365E-3]
[26,2.6499999999999999E-2,0.02,2.6000000000000016E-2,null,null,null,4.9969114832944124,7.3577128703681438E-2,0.40786162949016602,0.79914983201136269,1.2140341265551353,1.4354405730686978E-3]
["pH7 reference",2.6499999999999999E-2,0.02,null,0,null,null,7.0006187684125587,9.9500751631900794E-2,0.37372246908913692,0.78187495558041398,56.98797190114314,2.6247987914089322E-2]
["ammonia add. 1",2.6499999999999999E-2,0.02,null,{"$f":"E119+0.001","v":1E-3},null,null,7.0369384635466696,0.101491100652709,0.37160363765125914,0.78076437536844978,59.127793089808023,2.5889823000154903E-2]
[2,2.6499999999999999E-2,0.02,null,{"$f":"E120+0.001","v":2E-3},null,null,7.0738893174195221,0.10347978415231597,0.36954379363689666,0.77968015111672773,61.265784667428235,2.5435976155649062E-2]
[3,2.6499999999999999E-2,0.02,null,3.0000000000000001E-3,null,null,7.1116369449582484,0.10546652302306185,0.36754086373266764,0.77862152908258031,63.401639318117951,2.4887103383688755E-2]
[4,2.6499999999999999E-2,0.02,null,4.0000000000000001E-3,null,null,7.1503645897459398,0.10745096990771819,0.36559294374656176,0.77758782351713218,65.53497439046599,2.4244017942012659E-2]
[5,2.6499999999999999E-2,0.02,null,5.0000000000000001E-3,null,null,7.1902786418764455,0.10943268797506549,0.36369830328672298,0.77657842141904554,67.665308530116491,2.3507739959686729E-2]
[6,2.6499999999999999E-2,0.02,null,6.0000000000000001E-3,null,null,7.2316156028146334,0.11141112243701104,0.36185539557139962,0.77559279000654191,69.792030900769802,2.2679564842321968E-2]
[7,2.6499999999999999E-2,0.02,null,7.0000000000000001E-3,null,null,7.2746509372052719,0.11338555687517944,0.36006287854090296,0.77463049029602393,71.914352659321182,2.176116208621303E-2]
[8,2.6499999999999999E-2,0.02,null,8.0000000000000002E-3,null,null,7.3197106779734842,0.11535505163995796,0.35831964763551899,0.77369119713210055,74.031239131144488,2.0754717913344E-2]
[9,2.6499999999999999E-2,0.02,null,9.0000000000000011E-3,null,null,7.367186843821985,0.11731835303926044,0.35662488773897677,0.77277472987238927,76.141310102473298,1.9663146086481075E-2]
[10,2.6499999999999999E-2,0.02,null,1.0000000000000002E-2,null,null,7.4175580885317496,0.11927375343444288,0.35497815742923838,0.77188110109685171,78.242685575985121,1.8490409066719882E-2]
[11,2.6499999999999999E-2,0.02,null,1.1000000000000003E-2,null,null,7.4714176717054768,0.12121887463245967,0.35337952237509601,0.77101059289778118,80.332747413650608,1.7242016881158301E-2]
[12,2.6499999999999999E-2,0.02,null,1.2000000000000004E-2,null,null,7.5295112252749767,0.12315032024234482,0.35182977268724636,0.77016388034021122,82.40775664103947,1.5925824989118532E-2]
[13,2.6499999999999999E-2,0.02,null,1.3000000000000005E-2,null,null,7.5927867747757407,0.12506310294968928,0.35033078345763929,0.76934223550661984,84.462222963112197,1.4553344945702894E-2]
[14,2.6499999999999999E-2,0.02,null,1.4000000000000005E-2,null,null,7.6624569692269286,0.12694967662312887,0.34888612509561229,0.76854787229088362,86.487839322902232,1.3141951220278024E-2]
[15,2.6499999999999999E-2,0.02,null,1.5000000000000006E-2,null,null,7.7400626466290836,0.12879827097346364,0.3475021110223474,0.76778453792105361,88.471648598016003,1.1718657686579134E-2]
[16,2.6499999999999999E-2,0.02,null,1.6000000000000007E-2,null,null,7.827490881918771,0.13059004290594789,0.34618957727687627,0.76705851813703152,90.392907987887256,1.0326527057016055E-2]
[17,2.6499999999999999E-2,0.02,null,1.7000000000000008E-2,null,null,7.9267973188348959,0.13229451553711499,0.34496668920300488,0.76638022515299242,92.218068262272979,9.0347864291585069E-3]
[18,2.6499999999999999E-2,0.02,null,1.8000000000000009E-2,null,null,8.0394562405181471,0.13386395013121585,0.34386225772103929,0.76576608430347937,93.89457894673096,7.9508595996560308E-3]
[19,2.6499999999999999E-2,0.02,null,1.900000000000001E-2,null,null,8.1644973785033201,0.13523271647778451,0.342915520759765,0.7652384538637873,95.350196557336886,7.2200201734441841E-3]
[20,2.6499999999999999E-2,0.02,null,2.0000000000000011E-2,null,null,8.2961147225185545,0.13633707527518013,0.34216262912830947,0.76481807584127903,96.514763405793232,6.97810481308453E-3]
[21,2.6499999999999999E-2,0.02,null,2.1000000000000012E-2,null,null,8.4244180586641644,0.13715741359316957,0.34160959847866579,0.76450884829403565,97.366701573222599,7.2564638022357946E-3]
[22,2.6499999999999999E-2,0.02,null,2.2000000000000013E-2,null,null,8.5409916103202512,0.13773543862578311,0.34122307289893916,0.76429249921208908,97.951936484383182,7.9498188726414322E-3]
[23,2.6499999999999999E-2,0.02,null,2.3000000000000013E-2,null,null,8.6426832214431588,0.13813990385397151,0.34095414128710133,0.76414186227793213,98.346163394381833,8.9000650821167097E-3]
[24,2.6499999999999999E-2,0.02,null,2.4000000000000014E-2,null,null,8.7302688795788708,0.13843027708233335,0.34076184431003087,0.7640340961294374,98.614851617204522,9.977951350886978E-3]
[25,2.6499999999999999E-2,0.02,null,2.5000000000000015E-2,null,null,8.8059303333568213,0.1386469686196809,0.34061876199061375,0.76395388102469131,98.802488777457881,1.1101472892493101E-2]
[26,2.6499999999999999E-2,0.02,null,2.6000000000000016E-2,null,null,8.8719052117203674,0.13881526096605859,0.3405078844666975,0.76389170325731304,98.936907952443093,1.2224099918395454E-2]
["pH7 reference",2.6499999999999999E-2,0.02,null,null,0,null,7.0006187684125587,9.9500751631900794E-2,0.37372246908913692,0.78187495558041398,56.98797190114314,2.6247987914089322E-2]
["CO2 absorp. 1",2.6499999999999999E-2,0.02,null,null,{"$f":"F146+0.001","v":1E-3},null,6.9694818581685807,9.8659433428352455E-2,0.3746358866827918,0.78235226478586217,55.177281208438714,2.6793549442460079E-2]
["from air 2",2.6499999999999999E-2,0.02,null,null,{"$f":"F147+0.001","v":2E-3},null,6.9392998386951295,9.7837305460522481E-2,0.37553893781982811,0.78282329972568365,53.408089824913908,2.7295330507938264E-2]
[3,2.6499999999999999E-2,0.02,null,null,3.0000000000000001E-3,null,6.9099949679403823,9.7034844183834151E-2,0.37643053594777642,0.7832875280435746,51.681388343671443,2.7757489106203018E-2]
[4,2.6499999999999999E-2,0.02,null,null,4.0000000000000001E-3,null,6.881501553902619,9.6252488895900989E-2,0.37730960961767279,0.78374442858370352,49.998092855597143,2.8184069236815358E-2]
[5,2.6499999999999999E-2,0.02,null,null,5.0000000000000001E-3,null,6.8537639789653282,9.5490635041949073E-2,0.37817511359473327,0.78419349691864126,48.359029732404224,2.857897788684953E-2]
[6,2.6499999999999999E-2,0.02,null,null,6.0000000000000001E-3,null,6.8267351009646626,9.4749628486008722E-2,0.37902603943258445,0.78463425053706559,46.764922356843478,2.8945962055561675E-2]
[7,2.6499999999999999E-2,0.02,null,null,7.0000000000000001E-3,null,6.8003749235316056,9.4029760041784038E-2,0.3798614262122994,0.78506623406192055,45.216378735986886,2.9288586792906066E-2]
[8,2.6499999999999999E-2,0.02,null,null,8.0000000000000002E-3,null,6.7746494828889068,9.3331260828604323E-2,0.380680370713535,0.78548902412546984,43.713880840804912,2.9610215014956056E-2]
[9,2.6499999999999999E-2,0.02,null,null,9.0000000000000011E-3,null,6.7495298837904762,9.265429767839177E-2,0.3814820378215984,0.78590223432424899,42.257774675620198,2.9913989729636537E-2]
[10,2.6499999999999999E-2,0.02,null,null,1.0000000000000002E-2,null,6.7249914980237593,9.1998970611245942E-2,0.38226566869069134,0.78630551898321777,40.848264121219607,3.0202819421187292E-2]
[11,2.6499999999999999E-2,0.02,null,null,1.1000000000000003E-2,null,6.7010132480794145,9.136531037807695E-2,0.38303058887317359,0.78669857688197276,39.4854056377769,3.0479366933363075E-2]
[12,2.6499999999999999E-2,0.02,null,null,1.2000000000000004E-2,null,6.6775769948451513,9.075327761427629E-2,0.38377621447311638,0.78708115395275025,38.169106155769278,3.0746042298837647E-2]
[13,2.6499999999999999E-2,0.02,null,null,1.3000000000000005E-2,null,6.6546670012266755,9.0162763039586966E-2,0.38450205685338634,0.78745304523628334,36.899123336654895,3.1004999646713809E-2]
[14,2.6499999999999999E-2,0.02,null,null,1.4000000000000005E-2,null,6.6322694655197196,8.9593588835074803E-2,0.3852077256193191,0.78781409596502516,35.675068386871196,3.1258138208074743E-2]
["pH7 reference",2.6499999999999999E-2,0.02,null,null,null,null,7.0006187684125587,9.9500751631900794E-2,0.37372246908913692,0.78187495558041398,56.98797190114314,2.6247987914089322E-2]

{"sheet":"+pH","index":2,"n_rows":4,"n_cols":3,"rows_kept":4,"cut":false,"hidden":false,"merged":[]}
[null,"           ","Compilation of data and results obtained with the pH_calc module"]
[]
[]
[null,"Identify the results and add observations (use any gray cell)"]

{"sheet":"Titration","index":3,"n_rows":81,"n_cols":39,"rows_kept":81,"cut":false,"hidden":false,"merged":[]}
[null,null,"Manual Virtual Titrator with visual indicator",null,null,null,null,"<--- read instructions",null,null," pKas of the acids and bases in the solution",null,null,"Click on K2 to Q2; select acids/bases; click on J2; read M1",null,null,null,null,null,null,"          Overall protonation constants = bp = PKp (calculated by the program)",null,null,null,null,null,null,"  pKa(n) = -log Kd(HB-->B) = log Kp(1)",null,null,null,"       pKas loaded from the Database "]
["     Sample and titrant (standard) composition (concentrations in mol/L)",null,null,null,null,null,null,null,null,null,6,3,1,260,2,7,103,null,"Titrant",null,null,"Titrand",null,null,null,null,null,null,"Titrant",null,null,null,"    Titrand","Click on J2 to use these pKas in the Simulation"]
["SAMPLE\nSpecies",{"$f":"K3","v":"HCl"},"Carbonic acid","Acetic acid","Phenol Red (pKa 7.7)","Ammonia","Hydroxide ion","Glycine",null,"Acid / Base","HCl","Carbonic acid","Acetic acid","Phenol Red (pKa 7.7)","Ammonia","Hydroxide ion","Glycine","Strong ACID","Strong BASE","Carbonic ac.","Acid / Base",{"$f":"IF(K3=\"\",\"\",K3)","v":"HCl"},"Carbonic acid","Acetic acid","Phenol Red (pKa 7.7)","Ammonia","Hydroxide ion","Glycine",{"$f":"R3","v":"Strong ACID"},{"$f":"S3","v":"Strong BASE"},{"$f":"T3","v":"Carbonic ac."},"Acid / Base",{"$f":"IF(VLOOKUP(K$2,Database!$B$22:$N$301,2)=\"\",\"\",VLOOKUP(K$2,Database!$B$22:$N$301,2))","v":"HCl"},{"$f":"IF(VLOOKUP(L$2,Database!$B$22:$N$301,2)=\"\",\"\",VLOOKUP(L$2,Database!$B$22:$N$301,2))","v":"Carbonic acid"},{"$f":"IF(VLOOKUP(M$2,Database!$B$22:$N$301,2)=\"\",\"\",VLOOKUP(M$2,Database!$B$22:$N$301,2))","v":"Acetic acid"},{"$f":"IF(VLOOKUP(N$2,Database!$B$22:$N$301,2)=\"\",\"\",VLOOKUP(N$2,Database!$B$22:$N$301,2))","v":"Methyl Orange (pKa 3.5)"},{"$f":"IF(VLOOKUP(O$2,Database!$B$22:$N$301,2)=\"\",\"\",VLOOKUP(O$2,Database!$B$22:$N$301,2))","v":"Ammonia"},{"$f":"IF(VLOOKUP(P$2,Database!$B$22:$N$301,2)=\"\",\"\",VLOOKUP(P$2,Database!$B$22:$N$301,2))","v":"Hydroxide ion"},{"$f":"IF(VLOOKUP(Q$2,Database!$B$22:$N$301,2)=\"\",\"\",VLOOKUP(Q$2,Database!$B$22:$N$301,2))","v":"Glycine"}]
["[B]",null,null,null,null,null,null,null,null,"Charge of B",-1,-2,-1,-2,0,-1,-1,-1,-1,-2,"Charge of B",-1,-2,-1,-2,0,-1,-1,{"$f":"IF(R4=\"\",\"\",R4)","v":-1},{"$f":"IF(S4=\"\",\"\",S4)","v":-1},{"$f":"IF(T4=\"\",\"\",T4)","v":-2},"Charge of  B",{"$f":"IF(VLOOKUP(K$2,Database!$B$22:$N$301,3)=\"\",\"\",VLOOKUP(K$2,Database!$B$22:$N$301,3))","v":-1},{"$f":"IF(VLOOKUP(L$2,Database!$B$22:$N$301,3)=\"\",\"\",VLOOKUP(L$2,Database!$B$22:$N$301,3))","v":-2},{"$f":"IF(VLOOKUP(M$2,Database!$B$22:$N$301,3)=\"\",\"\",VLOOKUP(M$2,Database!$B$22:$N$301,3))","v":-1},{"$f":"IF(VLOOKUP(N$2,Database!$B$22:$N$301,3)=\"\",\"\",VLOOKUP(N$2,Database!$B$22:$N$301,3))","v":-2},{"$f":"IF(VLOOKUP(O$2,Database!$B$22:$N$301,3)=\"\",\"\",VLOOKUP(O$2,Database!$B$22:$N$301,3))","v":0},{"$f":"IF(VLOOKUP(P$2,Database!$B$22:$N$301,3)=\"\",\"\",VLOOKUP(P$2,Database!$B$22:$N$301,3))","v":-1},{"$f":"IF(VLOOKUP(Q$2,Database!$B$22:$N$301,3)=\"\",\"\",VLOOKUP(Q$2,Database!$B$22:$N$301,3))","v":-1}]
["[HB]",null,null,0.1,null,null,null,null,null,"pKa1",-7,6.3520000000000003,4.7569999999999997,1.2,9.2439999999999998,15.744999999999999,2.35,-6,15.744999999999999,6.3520000000000003,"bp1",{"$f":"IF(K5=\"\",\"\",IF(K6=\"\",10^K5,(IF(K7=\"\",10^K6,(IF(K8=\"\",10^K7,(IF(K9=\"\",10^K8,(IF(K10=\"\",10^K9,10^K10))))))))))","v":9.9999999999999995E-8},21330449131.465843,57147.863667186728,50118723.362727284,1753880501.8417609,5559042572704029,5997910762.5551224,{"$f":"IF(R5=\"\",\"\",IF(R6=\"\",10^R5,10^R6))","v":9.9999999999999995E-7},{"$f":"IF(S5=\"\",\"\",IF(S6=\"\",10^S5,10^S6))","v":5559042572704029},{"$f":"IF(T5=\"\",\"\",IF(T6=\"\",10^T5,10^T6))","v":21330449131.465843},"pKa1 = logKpn",{"$f":"IF(VLOOKUP(K$2,Database!$B$22:$N$301,4)=\"\",\"\",VLOOKUP(K$2,Database!$B$22:$N$301,4))","v":-7},{"$f":"IF(VLOOKUP(L$2,Database!$B$22:$N$301,4)=\"\",\"\",VLOOKUP(L$2,Database!$B$22:$N$301,4))","v":6.3520000000000003},{"$f":"IF(VLOOKUP(M$2,Database!$B$22:$N$301,4)=\"\",\"\",VLOOKUP(M$2,Database!$B$22:$N$301,4))","v":4.7569999999999997},{"$f":"IF(VLOOKUP(N$2,Database!$B$22:$N$301,4)=\"\",\"\",VLOOKUP(N$2,Database!$B$22:$N$301,4))","v":-1},{"$f":"IF(VLOOKUP(O$2,Database!$B$22:$N$301,4)=\"\",\"\",VLOOKUP(O$2,Database!$B$22:$N$301,4))","v":9.2439999999999998},{"$f":"IF(VLOOKUP(P$2,Database!$B$22:$N$301,4)=\"\",\"\",VLOOKUP(P$2,Database!$B$22:$N$301,4))","v":13.997},{"$f":"IF(VLOOKUP(Q$2,Database!$B$22:$N$301,4)=\"\",\"\",VLOOKUP(Q$2,Database!$B$22:$N$301,4))","v":2.35}]
["[H2B]",null,null,null,5.0000000000000002E-5,null,null,null,null,"pKa2","",10.329000000000001,"",7.7,"","",9.7780000000000005,null,null,10.329000000000001,"bp2",{"$f":"IF(K6=\"\",\"\",IF(K7=\"\",V5*10^K5,(IF(K8=\"\",V5*10^K6,(IF(K9=\"\",V5*10^K7,(IF(K10=\"\",V5*10^K8,V5*10^K9))))))))","v":""},4.7973344863669224E+16,"",794328234.7242825,"","",1342764961137.8711,{"$f":"IF(R6=\"\",\"\",AC5*10^R5)","v":""},{"$f":"IF(S6=\"\",\"\",AD5*10^S5)","v":""},{"$f":"IF(T6=\"\",\"\",AE5*10^T5)","v":4.7973344863669224E+16},"pKa2 = logKpn-1",{"$f":"IF(VLOOKUP(K$2,Database!$B$22:$N$301,5)=\"\",\"\",VLOOKUP(K$2,Database!$B$22:$N$301,5))","v":""},{"$f":"IF(VLOOKUP(L$2,Database!$B$22:$N$301,5)=\"\",\"\",VLOOKUP(L$2,Database!$B$22:$N$301,5))","v":10.329000000000001},{"$f":"IF(VLOOKUP(M$2,Database!$B$22:$N$301,5)=\"\",\"\",VLOOKUP(M$2,Database!$B$22:$N$301,5))","v":""},{"$f":"IF(VLOOKUP(N$2,Database!$B$22:$N$301,5)=\"\",\"\",VLOOKUP(N$2,Database!$B$22:$N$301,5))","v":3.47},{"$f":"IF(VLOOKUP(O$2,Database!$B$22:$N$301,5)=\"\",\"\",VLOOKUP(O$2,Database!$B$22:$N$301,5))","v":""},{"$f":"IF(VLOOKUP(P$2,Database!$B$22:$N$301,5)=\"\",\"\",VLOOKUP(P$2,Database!$B$22:$N$301,5))","v":""},{"$f":"IF(VLOOKUP(Q$2,Database!$B$22:$N$301,5)=\"\",\"\",VLOOKUP(Q$2,Database!$B$22:$N$301,5))","v":9.7780000000000005}]
["[H3B]",null,null,null,null,null,null,null,null,"pKa3","","","","","","","",null,null,null,"bp3",{"$f":"IF(K7=\"\",\"\",IF(K8=\"\",V6*10^K5,(IF(K9=\"\",V6*10^K6,(IF(K10=\"\",V6*10^K7,V6*10^K8))))))","v":""},"","","","","","",null,null,null,"pKa3 = logKpn-2",{"$f":"IF(VLOOKUP(K$2,Database!$B$22:$N$301,6)=\"\",\"\",VLOOKUP(K$2,Database!$B$22:$N$301,6))","v":""},{"$f":"IF(VLOOKUP(L$2,Database!$B$22:$N$301,6)=\"\",\"\",VLOOKUP(L$2,Database!$B$22:$N$301,6))","v":""},{"$f":"IF(VLOOKUP(M$2,Database!$B$22:$N$301,6)=\"\",\"\",VLOOKUP(M$2,Database!$B$22:$N$301,6))","v":""},{"$f":"IF(VLOOKUP(N$2,Database!$B$22:$N$301,6)=\"\",\"\",VLOOKUP(N$2,Database!$B$22:$N$301,6))","v":""},{"$f":"IF(VLOOKUP(O$2,Database!$B$22:$N$301,6)=\"\",\"\",VLOOKUP(O$2,Database!$B$22:$N$301,6))","v":""},{"$f":"IF(VLOOKUP(P$2,Database!$B$22:$N$301,6)=\"\",\"\",VLOOKUP(P$2,Database!$B$22:$N$301,6))","v":""},{"$f":"IF(VLOOKUP(Q$2,Database!$B$22:$N$301,6)=\"\",\"\",VLOOKUP(Q$2,Database!$B$22:$N$301,6))","v":""}]
["[H4B]",null,null,null,null,null,null,null,"Total","pKa4","","","","","","","",null,null,null,"bp4",{"$f":"IF(K8=\"\",\"\",IF(K9=\"\",V7*10^K5,(IF(K10=\"\",V7*10^K6,V7*10^K7))))","v":""},"","","","","","",null,null,null,"pKa4 = logKpn-3",{"$f":"IF(VLOOKUP(K$2,Database!$B$22:$N$301,7)=\"\",\"\",VLOOKUP(K$2,Database!$B$22:$N$301,7))","v":""},{"$f":"IF(VLOOKUP(L$2,Database!$B$22:$N$301,7)=\"\",\"\",VLOOKUP(L$2,Database!$B$22:$N$301,7))","v":""},{"$f":"IF(VLOOKUP(M$2,Database!$B$22:$N$301,7)=\"\",\"\",VLOOKUP(M$2,Database!$B$22:$N$301,7))","v":""},{"$f":"IF(VLOOKUP(N$2,Database!$B$22:$N$301,7)=\"\",\"\",VLOOKUP(N$2,Database!$B$22:$N$301,7))","v":""},{"$f":"IF(VLOOKUP(O$2,Database!$B$22:$N$301,7)=\"\",\"\",VLOOKUP(O$2,Database!$B$22:$N$301,7))","v":""},{"$f":"IF(VLOOKUP(P$2,Database!$B$22:$N$301,7)=\"\",\"\",VLOOKUP(P$2,Database!$B$22:$N$301,7))","v":""},{"$f":"IF(VLOOKUP(Q$2,Database!$B$22:$N$301,7)=\"\",\"\",VLOOKUP(Q$2,Database!$B$22:$N$301,7))","v":""}]
["[H5B]",null,null,null,null,null,null,null,"Sample","pKa5","","","","","","","",null,null,null,"bp5",{"$f":"IF(K9=\"\",\"\",IF(K10=\"\",V8*10^K5,V8*10^K6))","v":""},"","","","","","",null,null,null,"pKa5 = logKpn-4",{"$f":"IF(VLOOKUP(K$2,Database!$B$22:$N$301,8)=\"\",\"\",VLOOKUP(K$2,Database!$B$22:$N$301,8))","v":""},{"$f":"IF(VLOOKUP(L$2,Database!$B$22:$N$301,8)=\"\",\"\",VLOOKUP(L$2,Database!$B$22:$N$301,8))","v":""},{"$f":"IF(VLOOKUP(M$2,Database!$B$22:$N$301,8)=\"\",\"\",VLOOKUP(M$2,Database!$B$22:$N$301,8))","v":""},{"$f":"IF(VLOOKUP(N$2,Database!$B$22:$N$301,8)=\"\",\"\",VLOOKUP(N$2,Database!$B$22:$N$301,8))","v":""},{"$f":"IF(VLOOKUP(O$2,Database!$B$22:$N$301,8)=\"\",\"\",VLOOKUP(O$2,Database!$B$22:$N$301,8))","v":""},{"$f":"IF(VLOOKUP(P$2,Database!$B$22:$N$301,8)=\"\",\"\",VLOOKUP(P$2,Database!$B$22:$N$301,8))","v":""},{"$f":"IF(VLOOKUP(Q$2,Database!$B$22:$N$301,8)=\"\",\"\",VLOOKUP(Q$2,Database!$B$22:$N$301,8))","v":""}]
["[H6B]",null,null,null,null,null,null,null,"SS","pKa6","","","","","","","",null,null,null,"bp6",{"$f":"IF(K10=\"\",\"\",V9*10^K5)","v":""},"","","","","","",null,null,null,"pKa6 = logKpn-5",{"$f":"IF(VLOOKUP(K$2,Database!$B$22:$N$301,9)=\"\",\"\",VLOOKUP(K$2,Database!$B$22:$N$301,9))","v":""},{"$f":"IF(VLOOKUP(L$2,Database!$B$22:$N$301,9)=\"\",\"\",VLOOKUP(L$2,Database!$B$22:$N$301,9))","v":""},{"$f":"IF(VLOOKUP(M$2,Database!$B$22:$N$301,9)=\"\",\"\",VLOOKUP(M$2,Database!$B$22:$N$301,9))","v":""},{"$f":"IF(VLOOKUP(N$2,Database!$B$22:$N$301,9)=\"\",\"\",VLOOKUP(N$2,Database!$B$22:$N$301,9))","v":""},{"$f":"IF(VLOOKUP(O$2,Database!$B$22:$N$301,9)=\"\",\"\",VLOOKUP(O$2,Database!$B$22:$N$301,9))","v":""},{"$f":"IF(VLOOKUP(P$2,Database!$B$22:$N$301,9)=\"\",\"\",VLOOKUP(P$2,Database!$B$22:$N$301,9))","v":""},{"$f":"IF(VLOOKUP(Q$2,Database!$B$22:$N$301,9)=\"\",\"\",VLOOKUP(Q$2,Database!$B$22:$N$301,9))","v":""}]
["S[HiB]",{"$f":"SUM(B4:B10)","v":0},{"$f":"SUM(C4:C10)","v":0},0.1,5.0000000000000002E-5,0,0,0,{"$f":"SUM(B11:H11)","v":0.10005},"pKw",13.997," Remark: this virtual titrator calculates \"pH\" values disregarding ion-ion interactions (pH calculations are available in the Simulation or pH_calc modules).",null,null,null,null,null,null,null,null,"Kw",{"$f":"10^-K11","v":1.0069316688518014E-14},null,null,null,null,null,null,null,null,null,"Indicator: pKa1 or 2",{"$f":"IF(VLOOKUP(K$2,Database!$B$22:$R$301,14)=\"\",\"\",VLOOKUP(K$2,Database!$B$22:$R$301,14))","v":""},{"$f":"IF(VLOOKUP(L$2,Database!$B$22:$R$301,14)=\"\",\"\",VLOOKUP(L$2,Database!$B$22:$R$301,14))","v":""},{"$f":"IF(VLOOKUP(M$2,Database!$B$22:$R$301,14)=\"\",\"\",VLOOKUP(M$2,Database!$B$22:$R$301,14))","v":""},{"$f":"IF(VLOOKUP(N$2,Database!$B$22:$R$301,14)=\"\",\"\",VLOOKUP(N$2,Database!$B$22:$R$301,14))","v":3.47},{"$f":"IF(VLOOKUP(O$2,Database!$B$22:$R$301,14)=\"\",\"\",VLOOKUP(O$2,Database!$B$22:$R$301,14))","v":""},{"$f":"IF(VLOOKUP(P$2,Database!$B$22:$R$301,14)=\"\",\"\",VLOOKUP(P$2,Database!$B$22:$R$301,14))","v":""},{"$f":"IF(VLOOKUP(Q$2,Database!$B$22:$R$301,14)=\"\",\"\",VLOOKUP(Q$2,Database!$B$22:$R$301,14))","v":""}]
["S[H]",{"$f":"B5+2*B6+3*B7+4*B8+5*B9+6*B10","v":0},{"$f":"C5+2*C6+3*C7+4*C8+5*C9+6*C10","v":0},0.1,1E-4,0,0,0,{"$f":"SUM(B12:H12)","v":0.10010000000000001},null,null,null,null,"Color  coding",null,null,null,null,null,null,null,null,null,null,null,null,null,null,null,null,null,"color #, pH < pKa indic",{"$f":"IF(VLOOKUP(K$2,Database!$B$22:$R$301,15)=\"\",\"\",VLOOKUP(K$2,Database!$B$22:$R$301,15))","v":""},{"$f":"IF(VLOOKUP(L$2,Database!$B$22:$R$301,15)=\"\",\"\",VLOOKUP(L$2,Database!$B$22:$R$301,15))","v":""},{"$f":"IF(VLOOKUP(M$2,Database!$B$22:$R$301,15)=\"\",\"\",VLOOKUP(M$2,Database!$B$22:$R$301,15))","v":""},{"$f":"IF(VLOOKUP(N$2,Database!$B$22:$R$301,15)=\"\",\"\",VLOOKUP(N$2,Database!$B$22:$R$301,15))","v":5263615},{"$f":"IF(VLOOKUP(O$2,Database!$B$22:$R$301,15)=\"\",\"\",VLOOKUP(O$2,Database!$B$22:$R$301,15))","v":""},{"$f":"IF(VLOOKUP(P$2,Database!$B$22:$R$301,15)=\"\",\"\",VLOOKUP(P$2,Database!$B$22:$R$301,15))","v":""},{"$f":"IF(VLOOKUP(Q$2,Database!$B$22:$R$301,15)=\"\",\"\",VLOOKUP(Q$2,Database!$B$22:$R$301,15))","v":""}]
["TITRANT",{"$f":"R3","v":"Strong ACID"},{"$f":"S3","v":"Strong BASE"},{"$f":"T3","v":"Carbonic ac."},"Total","  Volume of titrand in beaker (mL)",null,null,null,null,null,null,null,"D  o     n  o  t     c  h  a  n  g  e ",null,null,null,null,null,null,null,null,null,null,null,null,null,null,null,null,null,"color #, pH = pKa indic",{"$f":"IF(VLOOKUP(K$2,Database!$B$22:$R$301,16)=\"\",\"\",VLOOKUP(K$2,Database!$B$22:$R$301,16))","v":""},{"$f":"IF(VLOOKUP(L$2,Database!$B$22:$R$301,16)=\"\",\"\",VLOOKUP(L$2,Database!$B$22:$R$301,16))","v":""},{"$f":"IF(VLOOKUP(M$2,Database!$B$22:$R$301,16)=\"\",\"\",VLOOKUP(M$2,Database!$B$22:$R$301,16))","v":""},{"$f":"IF(VLOOKUP(N$2,Database!$B$22:$R$301,16)=\"\",\"\",VLOOKUP(N$2,Database!$B$22:$R$301,16))","v":4961023},{"$f":"IF(VLOOKUP(O$2,Database!$B$22:$R$301,16)=\"\",\"\",VLOOKUP(O$2,Database!$B$22:$R$301,16))","v":""},{"$f":"IF(VLOOKUP(P$2,Database!$B$22:$R$301,16)=\"\",\"\",VLOOKUP(P$2,Database!$B$22:$R$301,16))","v":""},{"$f":"IF(VLOOKUP(Q$2,Database!$B$22:$R$301,16)=\"\",\"\",VLOOKUP(Q$2,Database!$B$22:$R$301,16))","v":""}]
["[B]",null,0.1,null,"Titrants","SAMPLE","Water","Sum",null,"           Titrant reservoir",null,null,null," C h a n g e   c r i t e r i o u s l y",null,null,null,null,null,null,null,null,null,null,null,null,null,null,null,null,null,"color #, pH > pKa indic",{"$f":"IF(VLOOKUP(K$2,Database!$B$22:$R$301,17)=\"\",\"\",VLOOKUP(K$2,Database!$B$22:$R$301,17))","v":""},{"$f":"IF(VLOOKUP(L$2,Database!$B$22:$R$301,17)=\"\",\"\",VLOOKUP(L$2,Database!$B$22:$R$301,17))","v":""},{"$f":"IF(VLOOKUP(M$2,Database!$B$22:$R$301,17)=\"\",\"\",VLOOKUP(M$2,Database!$B$22:$R$301,17))","v":""},{"$f":"IF(VLOOKUP(N$2,Database!$B$22:$R$301,17)=\"\",\"\",VLOOKUP(N$2,Database!$B$22:$R$301,17))","v":4907000},{"$f":"IF(VLOOKUP(O$2,Database!$B$22:$R$301,17)=\"\",\"\",VLOOKUP(O$2,Database!$B$22:$R$301,17))","v":""},{"$f":"IF(VLOOKUP(P$2,Database!$B$22:$R$301,17)=\"\",\"\",VLOOKUP(P$2,Database!$B$22:$R$301,17))","v":""},{"$f":"IF(VLOOKUP(Q$2,Database!$B$22:$R$301,17)=\"\",\"\",VLOOKUP(Q$2,Database!$B$22:$R$301,17))","v":""}]
["[HB]",null,null,null,null,"Dispensed","added","(initial vol.)",null,"    Composition: cells B13 to D16",null,null,null,"Fill out, change or leave blank"]
["[H2B]",null,null,null,"SS",20,0,{"$f":"F16+G16","v":20}]
["S[HiB]",{"$f":"SUM(B14:B16)","v":0},{"$f":"SUM(C14:C16)","v":0.1},{"$f":"SUM(D14:D16)","v":0},{"$f":"SUM(B17:D17)","v":0.1},"Buret (syringe) capacity"]
["S[H]",{"$f":"B15+2*B16","v":0},{"$f":"C15+2*C16","v":0},{"$f":"D15+2*D16","v":0},{"$f":"SUM(B18:D18)","v":0},50,null," mL of titrant                  ."]
["  Unknown sample"]
["Digital BURET"," motor",{"$f":"B21","v":27.910000000000014},null,null,null,"pH-meter"]
["Volume, mL",27.910000000000014,"Syringe with titrant",null,null,"\"pH\"  ",12.21319927694276]
[null,"Titrant addition (mL)    "]
[]
[null,null,null,null,null,null,"Display (or hide)"]
[null,null,null,null,null,true,"pH and titration curve"]
[null,null,null,null,null,true,"Titrand equilibrium"]
[]
["  Model INDICATOR",null,null,null,null,null," TITRAND equilibrium"]
["pKa, indicator",7.7,null,null,null,null,"Molar fraction","Acetic acid"]
["Region","Color",null,null,null,null,"% B",99.99999650215382]
["pH > pK+1",{"$f":"B29+1","v":8.6999999999999993},null,12.21319927694276,{"$f":"$D$31","v":12.21319927694276},null,"% HB",3.4978461854644776E-6]
["pH = pK",{"$f":"B29","v":7.7},null,{"$f":"$D$31","v":12.21319927694276},{"$f":"$D$31","v":12.21319927694276},null,"% H2B"]
["pH < pK-1",{"$f":"B29-1","v":6.7},null,{"$f":"$D$31","v":12.21319927694276},{"$f":"$D$31","v":12.21319927694276},null,"% H3B"]
["  INDICATOR equilibrium",null,null,{"$f":"$D$31","v":12.21319927694276},{"$f":"$D$31","v":12.21319927694276},null,"% H4B",null,null,null,null,null,null,null,null,null,null," Data ID on curves"]
["Molar fraction","Indicator",null,{"$f":"$D$31","v":12.21319927694276},{"$f":"$D$31","v":12.21319927694276},null,"% H5B",null,null,null,null,null,null,null,null,null,null," Copying curves"]
["% Ind",99.996932480015474,null,"         Magnetic stirrer",null,null,"% H6B",null,null,null,null,null,null,null,null,null,null," Resizing axis"]
["% Hind",3.0675199845231482E-3,null,null,null,null,null,null,null,null,null,null,null,null,null,null,null," Other graphics"]
[null,null,null,null,null,null,null,null,null,null,null,null,null,null,null,null,null," Data analysis"]
["Vadd","\"pH\"","Vadd","\"pH\"","[H]","CHtot =","Dil. factor","Dil. Factor","h1","h2","h3","h4","h5","h6","h7","h1 titrant","h2 titrant","h3 titrant"]
["(mL)","simulated","on graphic","on graphic",null,"CHcalc","Titrand (sample)","Titrant (buret)",{"$f":"K3","v":"HCl"},"Carbonic acid","Acetic acid","Phenol Red (pKa 7.7)","Ammonia","Hydroxide ion","Glycine","Strong ACID","Strong BASE","Carbonic ac."]
[0,2.8732302361167967,0,2.8732302361167967,1.3389666617932572E-3,0.10009999999813043,1,0,null,null,0.9870999507950482,1.020765315764889,null,null,null,null,0.99999999999986566]
[2,3.8085675346665084,2,3.8085675346665084,1.5539336285957283E-4,9.1000000009423987E-2,0.90909090909090906,9.0909090909090912E-2,null,null,0.8987895096309122,1.0023283847338127,null,null,null,null,0.99999999999884237]
[4,4.1558583942241967,4,4.1558583942241967,6.9846010640012724E-5,8.341666665964223E-2,0.83333333333333337,0.16666666666666666,null,null,0.79966143943113877,1.0008201765518951,null,null,null,null,0.9999999999974245]
[6,4.3890868783928454,6,4.3890868783928454,4.0823771229455128E-5,7.6999999969965732E-2,0.76923076923076927,0.23076923076923078,null,null,0.69996921475020357,1.0001580835029342,null,null,null,null,0.99999999999559352]
[8,4.5806689499877393,8,4.5806689499877393,2.6262196712177228E-5,7.1500000010245868E-2,0.7142857142857143,0.2857142857142857,null,null,0.60013250631745496,0.99965688434123023,null,null,null,null,0.99999999999315037]
[10,4.756587051320821,10,4.756587051320821,1.7515113207079535E-5,6.6733333331724376E-2,0.66666666666666663,0.33333333333333331,null,null,0.50023771208224632,0.99913964865144611,null,null,null,null,0.99999999998972966]
[12,4.9325233497656882,12,4.9325233497656882,1.1680909259718396E-5,6.2562499980916828E-2,0.625,0.375,null,null,0.40031387901426657,0.99847986839702274,null,null,null,null,0.99999999998459987]
[13,5.0251862998120487,13,5.0251862998120487,9.4365598823608279E-6,6.0666666669311482E-2,0.60606060606060608,0.39393939393939392,null,null,0.35034529462329556,0.99803960179123974,null,null,null,null,0.99999999998093725]
[14,5.1242044870741665,14,5.1242044870741665,7.5126907651767135E-6,5.8882352934952836E-2,0.58823529411764708,0.41176470588235292,null,null,0.30037357183718771,0.99747023226013765,null,null,null,null,0.9999999999760556]
[15,5.2331966585479677,15,5.2331966585479677,5.8452533766643153E-6,5.72000000015997E-2,0.5714285714285714,0.42857142857142855,null,null,0.25039939287866958,0.99669076910609433,null,null,null,null,0.99999999996922506]
[16,5.357911869417876,16,5.357911869417876,4.3861969703454432E-6,5.5611111120401228E-2,0.55555555555555558,0.44444444444444442,null,null,0.20042331940066108,0.99554115221811934,null,null,null,null,0.99999999995898792]
[16.5,5.4291094332002103,16.5,5.4291094332002103,3.7229788309092037E-6,5.4849315076457864E-2,0.54794520547945202,0.45205479452054792,null,null,0.17543474105494344,0.994728252428419,null,null,null,null,0.99999999995168198]
[17,5.508810659404844,17,5.508810659404844,3.0987699842896601E-6,5.4108108108327897E-2,0.54054054054054057,0.45945945945945948,null,null,0.1504459072151117,0.99365141692549186,null,null,null,null,0.99999999994194888]
[17.5,5.6002865410409868,17.5,5.6002865410409868,2.5102296728075381E-6,5.3386666670779313E-2,0.53333333333333333,0.46666666666666667,null,null,0.1254569315773594,0.99215393631582682,null,null,null,null,0.99999999992833843]
[18,5.7089888504706323,18,5.7089888504706323,1.9543896296683889E-6,5.2684210534268701E-2,0.52631578947368418,0.47368421052631576,null,null,0.1004680022162532,0.98992501123208043,null,null,null,null,0.9999999999079574]
[18.5,5.8450874635018408,18.5,5.8450874635018408,1.4286062194519564E-6,5.1999999994064197E-2,0.51948051948051943,0.48051948051948051,null,null,7.5479510754658974E-2,0.98624851718794393,null,null,null,null,0.99999999987408206]
[19,6.0312710306607187,19,6.0312710306607187,9.3052697917589026E-7,5.1333333334999266E-2,0.51282051282051277,0.48717948717948717,null,null,5.0492554662420003E-2,0.97902257773817947,null,null,null,null,0.99999999980668253]
[19.5,6.3390276008285582,19.5,6.3390276008285582,4.5811277123094471E-7,5.0683544302003461E-2,0.50632911392405067,0.49367088607594939,null,null,2.5512251190972689E-2,0.95827106827994435,null,null,null,null,0.9999999996073301]
[19.7,6.5590608413331211,19.7,6.5590608413331211,2.7601911474783683E-7,5.0428211587032333E-2,0.50377833753148615,0.49622166246851379,null,null,1.5528950599401495E-2,0.93259040744713784,null,null,null,null,0.99999999934828032]
[19.8,6.729320949409157,19.8,6.729320949409157,1.8650009209008174E-7,5.0301507537237937E-2,0.50251256281407042,0.49748743718592969,null,null,1.0545685051076175E-2,0.90335792576678775,null,null,null,null,0.99999999903545844]
[19.900000000000002,7.0075858007185161,19.900000000000002,7.0075858007185161,9.8268471123388591E-8,5.0175438596577096E-2,0.50125313283208017,0.49874686716791977,null,null,5.5844717348101048E-3,0.83122771468133938,null,null,null,null,0.9999999981694323]
[19.950000000000003,7.2593171945773065,19.950000000000003,7.2593171945773065,5.5040555123704652E-8,5.0112640801244064E-2,0.50062578222778464,0.4993742177722153,null,null,3.1355873101927977E-3,0.73394163569063808,null,null,null,null,0.99999999673173556]
[19.970000000000002,7.4183593583293259,19.970000000000002,7.4183593583293259,3.8162836057532731E-8,5.0087565674162345E-2,0.50037528146109589,0.49962471853890428,null,null,2.1761784687832552E-3,0.65667324273625094,null,null,null,null,0.99999999528632799]
[19.980000000000004,7.524222097825259,19.980000000000004,7.524222097825259,2.9907347862569245E-8,5.0075037518871948E-2,0.50025012506253119,0.49974987493746881,null,null,1.7062248611958595E-3,0.5998272184513388,null,null,null,null,0.99999999398518746]
[19.990000000000006,7.6604494755156338,19.990000000000006,7.6604494755156338,2.1854985590452048E-8,5.0062515628844777E-2,0.50012503125781438,0.49987496874218557,null,null,1.2474077660741239E-3,0.52275165743186436,null,null,null,null,0.99999999176905929]
[20.000000000000007,7.8499296265654266,20.000000000000007,7.8499296265654266,1.4127664519123931E-8,5.0050000000012106E-2,0.49999999999999989,0.50000000000000011,null,null,8.0671453297832742E-4,0.41454079497715701,null,null,null,null,0.99999998726703276]
[20.010000000000009,8.1557883764617145,20.010000000000009,8.1557883764617145,6.9857272251276364E-9,5.0037490627351786E-2,0.4998750312421894,0.50012496875781065,null,null,3.9906007498708736E-4,0.25932280484053238,null,null,null,null,0.99999997424933995]
[20.02000000000001,8.8002537922002375,20.02000000000001,8.8002537922002375,1.5839672860960506E-9,5.0024987506237809E-2,0.49975012493753113,0.50024987506246887,null,null,9.0512153230576858E-5,7.3547731050991369E-2,null,null,null,null,0.99999988643258431]
[20.030000000000012,9.420395974535495,20.030000000000012,9.420395974535495,3.7984291089246862E-10,5.0012490631989065E-2,0.49962528103922038,0.50037471896077956,null,null,2.1706739670579962E-5,1.868159592111035E-2,null,null,null,null,0.99999952641736534]
[20.040000000000013,9.7021594396792352,20.040000000000013,9.7021594396792352,1.9853659092078828E-10,5.0000000000021971E-2,0.49950049950049935,0.50049950049950065,null,null,1.1345813314114336E-5,9.8523655675628093E-3,null,null,null,null,0.99999909393564435]
[20.060000000000013,9.9977490934543312,20.060000000000013,9.9977490934543312,1.0051963583383628E-10,4.9975037443854273E-2,0.49925112331502725,0.5007488766849727,null,null,5.7444494517776452E-6,5.0126624706988403E-3,null,null,null,null,0.99999821043154502]
[20.110000000000014,10.347956786397845,20.110000000000014,10.347956786397845,4.4879004366548672E-11,4.9912739965046103E-2,0.49862877088007962,0.50137122911992038,null,null,2.5647326424382271E-6,2.2442305062188497E-3,null,null,null,null,0.99999599174774012]
[20.210000000000015,10.671109877061099,20.210000000000015,10.671109877061099,2.1325053183089358E-11,4.9788609799468239E-2,0.49738870927629925,0.50261129072370081,null,null,1.218679748127259E-6,1.0676433624310303E-3,null,null,null,null,0.99999156458967042]
[20.410000000000014,10.981203193310648,20.410000000000014,10.981203193310648,1.044231540416706E-11,4.954219252500619E-2,0.49492699826775538,0.50507300173224468,null,null,5.9675566032971587E-7,5.2308175889575429E-4,null,null,null,null,0.99998277355299781]
[20.910000000000014,11.334167880471796,20.910000000000014,11.334167880471796,4.6326780474667635E-12,4.89366903004059E-2,0.48887802493277915,0.5111219750672209,null,null,2.6474758366316677E-7,2.3213001291864384E-4,null,null,null,null,0.99996117146395136]
[21.410000000000014,11.522510181646794,21.410000000000014,11.522510181646794,3.0025470279989311E-12,4.8345810195814916E-2,0.48297512678097065,0.51702487321902946,null,null,1.7158911895155093E-7,1.5046118208148166E-4,null,null,null,null,0.99994009209082058]
[21.910000000000014,11.65073959948495,21.910000000000014,11.65073959948495,2.2349118616824213E-12,4.7769028866014605E-2,0.47721307563827237,0.52278692436172769,null,null,1.2772042193015224E-7,1.1199838418049014E-4,null,null,null,null,0.9999195169094045]
[22.910000000000014,11.824925706256181,22.910000000000014,11.824925706256181,1.4964916355317124E-12,4.6655791184622215E-2,0.46609182008855732,0.53390817991144279,null,null,8.5521292560861439E-8,7.4996625303331275E-5,null,null,null,null,0.99987980856922398]
[23.910000000000014,11.943964170757681,23.910000000000014,11.943964170757681,1.1377211438087334E-12,4.5593258928847268E-2,0.45547711227510806,0.54452288772489199,null,null,6.5018328520559654E-8,5.701787998737637E-5,null,null,null,null,0.9998419132360189]
[25.910000000000014,12.104770549107343,25.910000000000014,12.104770549107343,7.8565060792569933E-13,4.3607057262516118E-2,0.43563493792202124,0.56436506207797887,null,null,4.4898251767786113E-8,3.9374255044141682E-5,null,null,null,null,0.99977108664928849]
[27.910000000000014,12.21319927694276,27.910000000000014,12.21319927694276,6.1206947790458902E-13,4.1786683339230156E-2,0.41744938426215811,0.58255061573784195,null,null,3.4978461817140012E-8,3.0675199812823656E-5,null,null,null,null,0.99970618656059063]

{"sheet":"Simulation","index":4,"n_rows":91,"n_cols":78,"rows_kept":91,"cut":false,"hidden":false,"merged":[]}
[null,null,"  Virtual Titrator – Simulation of curves  ",null,null,null,null,"<--- read instructions",null,null," pKas of the acids and bases in the solution",null,null,"Click on K2 to Q2; select acids/bases; click on J2; read M1",null,null,null,null,null,null,"          Overall protonation constants = bp = PKp (calculated by the program)",null,null,null,null,null,null,"  pKa(n) = -log Kd(HB-->B) = log Kp(1)",null,null,null,"       pKas loaded from the Database "]
["     Titrand (sample) and titrant (standard) composition (concentrations in mol/L)",null,null,null,null,null,null,null,null,null,5,8,98,1,2,6,3,null,"Titrant",null,null,"Titrand",null,null,null,null,null,null,"Titrant",null,null,null,"    Titrand","Click on J2 to use these pKas in the Simulation"]
["SAMPLE\nSpecies",{"$f":"K3","v":"EDTA"},{"$f":"L3","v":"Phosphoric acid"},"L-Glutamic acid ","Acetic acid","Ammonia","HCl","Carbonic acid",null,"Acid / Base","EDTA","Phosphoric acid","L-Glutamic acid ","Acetic acid","Ammonia","HCl","Carbonic acid","Strong ACID","Strong BASE","Carbonic ac.","Acid / Base",{"$f":"IF(K3=\"\",\"\",K3)","v":"EDTA"},"Phosphoric acid","L-Glutamic acid ","Acetic acid","Ammonia","HCl","Carbonic acid",{"$f":"R3","v":"Strong ACID"},{"$f":"S3","v":"Strong BASE"},{"$f":"T3","v":"Carbonic ac."},"Acid / Base",{"$f":"IF(VLOOKUP(K$2,Database!$B$22:$N$301,2)=\"\",\"\",VLOOKUP(K$2,Database!$B$22:$N$301,2))","v":"EDTA"},{"$f":"IF(VLOOKUP(L$2,Database!$B$22:$N$301,2)=\"\",\"\",VLOOKUP(L$2,Database!$B$22:$N$301,2))","v":"Phosphoric acid"},{"$f":"IF(VLOOKUP(M$2,Database!$B$22:$N$301,2)=\"\",\"\",VLOOKUP(M$2,Database!$B$22:$N$301,2))","v":"L-Glutamic acid "},{"$f":"IF(VLOOKUP(N$2,Database!$B$22:$N$301,2)=\"\",\"\",VLOOKUP(N$2,Database!$B$22:$N$301,2))","v":"Acetic acid"},{"$f":"IF(VLOOKUP(O$2,Database!$B$22:$N$301,2)=\"\",\"\",VLOOKUP(O$2,Database!$B$22:$N$301,2))","v":"Ammonia"},{"$f":"IF(VLOOKUP(P$2,Database!$B$22:$N$301,2)=\"\",\"\",VLOOKUP(P$2,Database!$B$22:$N$301,2))","v":"HCl"},{"$f":"IF(VLOOKUP(Q$2,Database!$B$22:$N$301,2)=\"\",\"\",VLOOKUP(Q$2,Database!$B$22:$N$301,2))","v":"Carbonic acid"}]
["[B]",null,null,null,null,null,null,null,null,"Charge of B",-4,-3,-2,-1,0,-1,-2,-1,-1,-2,"Charge of B",-4,{"$f":"IF(L4=\"\",\"\",L4)","v":-3},-2,-1,0,-1,-2,{"$f":"IF(R4=\"\",\"\",R4)","v":-1},{"$f":"IF(S4=\"\",\"\",S4)","v":-1},{"$f":"IF(T4=\"\",\"\",T4)","v":-2},"Charge of  B",{"$f":"IF(VLOOKUP(K$2,Database!$B$22:$N$301,3)=\"\",\"\",VLOOKUP(K$2,Database!$B$22:$N$301,3))","v":-4},{"$f":"IF(VLOOKUP(L$2,Database!$B$22:$N$301,3)=\"\",\"\",VLOOKUP(L$2,Database!$B$22:$N$301,3))","v":-3},{"$f":"IF(VLOOKUP(M$2,Database!$B$22:$N$301,3)=\"\",\"\",VLOOKUP(M$2,Database!$B$22:$N$301,3))","v":-2},{"$f":"IF(VLOOKUP(N$2,Database!$B$22:$N$301,3)=\"\",\"\",VLOOKUP(N$2,Database!$B$22:$N$301,3))","v":-1},{"$f":"IF(VLOOKUP(O$2,Database!$B$22:$N$301,3)=\"\",\"\",VLOOKUP(O$2,Database!$B$22:$N$301,3))","v":0},{"$f":"IF(VLOOKUP(P$2,Database!$B$22:$N$301,3)=\"\",\"\",VLOOKUP(P$2,Database!$B$22:$N$301,3))","v":-1},{"$f":"IF(VLOOKUP(Q$2,Database!$B$22:$N$301,3)=\"\",\"\",VLOOKUP(Q$2,Database!$B$22:$N$301,3))","v":-2}]
["[HB]",null,null,null,null,null,null,null,null,"pKa1",-0.21,2.1480000000000001,2.23,4.7569999999999997,9.2439999999999998,-7,6.3520000000000003,-6,15.744999999999999,6.3520000000000003,"bp1",{"$f":"IF(K5=\"\",\"\",IF(K6=\"\",10^K5,(IF(K7=\"\",10^K6,(IF(K8=\"\",10^K7,(IF(K9=\"\",10^K8,(IF(K10=\"\",10^K9,10^K10))))))))))","v":107151930523.76077},2238721138568.3457,8912509381.3374634,57147.863667186728,1753880501.8417609,9.9999999999999995E-8,21330449131.465843,{"$f":"IF(R5=\"\",\"\",IF(R6=\"\",10^R5,10^R6))","v":9.9999999999999995E-7},{"$f":"IF(S5=\"\",\"\",IF(S6=\"\",10^S5,10^S6))","v":5559042572704029},{"$f":"IF(T5=\"\",\"\",IF(T6=\"\",10^T5,10^T6))","v":21330449131.465843},"pKa1 = logKpn",{"$f":"IF(VLOOKUP(K$2,Database!$B$22:$N$301,4)=\"\",\"\",VLOOKUP(K$2,Database!$B$22:$N$301,4))","v":-0.21},{"$f":"IF(VLOOKUP(L$2,Database!$B$22:$N$301,4)=\"\",\"\",VLOOKUP(L$2,Database!$B$22:$N$301,4))","v":2.1480000000000001},{"$f":"IF(VLOOKUP(M$2,Database!$B$22:$N$301,4)=\"\",\"\",VLOOKUP(M$2,Database!$B$22:$N$301,4))","v":2.23},{"$f":"IF(VLOOKUP(N$2,Database!$B$22:$N$301,4)=\"\",\"\",VLOOKUP(N$2,Database!$B$22:$N$301,4))","v":4.7569999999999997},{"$f":"IF(VLOOKUP(O$2,Database!$B$22:$N$301,4)=\"\",\"\",VLOOKUP(O$2,Database!$B$22:$N$301,4))","v":9.2439999999999998},{"$f":"IF(VLOOKUP(P$2,Database!$B$22:$N$301,4)=\"\",\"\",VLOOKUP(P$2,Database!$B$22:$N$301,4))","v":-7},{"$f":"IF(VLOOKUP(Q$2,Database!$B$22:$N$301,4)=\"\",\"\",VLOOKUP(Q$2,Database!$B$22:$N$301,4))","v":6.3520000000000003}]
["[H2B]",null,null,null,null,null,null,null,null,"pKa2",1.5,7.1989999999999998,4.42,"","","",10.329000000000001,null,null,10.329000000000001,"bp2",{"$f":"IF(K6=\"\",\"\",IF(K7=\"\",V5*10^K5,(IF(K8=\"\",V5*10^K6,(IF(K9=\"\",V5*10^K7,(IF(K10=\"\",V5*10^K8,V5*10^K9))))))))","v":6.0255958607435917E+17},3.539973410834362E+19,234422881531992.5,"","","",4.7973344863669224E+16,{"$f":"IF(R6=\"\",\"\",AC5*10^R5)","v":""},{"$f":"IF(S6=\"\",\"\",AD5*10^S5)","v":""},{"$f":"IF(T6=\"\",\"\",AE5*10^T5)","v":4.7973344863669224E+16},"pKa2 = logKpn-1",{"$f":"IF(VLOOKUP(K$2,Database!$B$22:$N$301,5)=\"\",\"\",VLOOKUP(K$2,Database!$B$22:$N$301,5))","v":1.5},{"$f":"IF(VLOOKUP(L$2,Database!$B$22:$N$301,5)=\"\",\"\",VLOOKUP(L$2,Database!$B$22:$N$301,5))","v":7.1989999999999998},{"$f":"IF(VLOOKUP(M$2,Database!$B$22:$N$301,5)=\"\",\"\",VLOOKUP(M$2,Database!$B$22:$N$301,5))","v":4.42},{"$f":"IF(VLOOKUP(N$2,Database!$B$22:$N$301,5)=\"\",\"\",VLOOKUP(N$2,Database!$B$22:$N$301,5))","v":""},{"$f":"IF(VLOOKUP(O$2,Database!$B$22:$N$301,5)=\"\",\"\",VLOOKUP(O$2,Database!$B$22:$N$301,5))","v":""},{"$f":"IF(VLOOKUP(P$2,Database!$B$22:$N$301,5)=\"\",\"\",VLOOKUP(P$2,Database!$B$22:$N$301,5))","v":""},{"$f":"IF(VLOOKUP(Q$2,Database!$B$22:$N$301,5)=\"\",\"\",VLOOKUP(Q$2,Database!$B$22:$N$301,5))","v":10.329000000000001}]
["[H3B]",null,0.05,null,null,null,null,null,null,"pKa3",2.21,12.35,9.9499999999999993,"","","","",null,null,null,"bp3",{"$f":"IF(K7=\"\",\"\",IF(K8=\"\",V6*10^K5,(IF(K9=\"\",V6*10^K6,(IF(K10=\"\",V6*10^K7,V6*10^K8))))))","v":7.7624711662869401E+20},4.9773708497893867E+21,3.9810717055349776E+16,"","","","",null,null,null,"pKa3 = logKpn-2",{"$f":"IF(VLOOKUP(K$2,Database!$B$22:$N$301,6)=\"\",\"\",VLOOKUP(K$2,Database!$B$22:$N$301,6))","v":2.21},{"$f":"IF(VLOOKUP(L$2,Database!$B$22:$N$301,6)=\"\",\"\",VLOOKUP(L$2,Database!$B$22:$N$301,6))","v":12.35},{"$f":"IF(VLOOKUP(M$2,Database!$B$22:$N$301,6)=\"\",\"\",VLOOKUP(M$2,Database!$B$22:$N$301,6))","v":9.9499999999999993},{"$f":"IF(VLOOKUP(N$2,Database!$B$22:$N$301,6)=\"\",\"\",VLOOKUP(N$2,Database!$B$22:$N$301,6))","v":""},{"$f":"IF(VLOOKUP(O$2,Database!$B$22:$N$301,6)=\"\",\"\",VLOOKUP(O$2,Database!$B$22:$N$301,6))","v":""},{"$f":"IF(VLOOKUP(P$2,Database!$B$22:$N$301,6)=\"\",\"\",VLOOKUP(P$2,Database!$B$22:$N$301,6))","v":""},{"$f":"IF(VLOOKUP(Q$2,Database!$B$22:$N$301,6)=\"\",\"\",VLOOKUP(Q$2,Database!$B$22:$N$301,6))","v":""}]
["[H4B]",null,null,null,null,null,null,null,null,"pKa4",3.11,"","","","","","",null,null,null,"bp4",{"$f":"IF(K8=\"\",\"\",IF(K9=\"\",V7*10^K5,(IF(K10=\"\",V7*10^K6,V7*10^K7))))","v":1.2589254117941712E+23},"","","","","","",null,null,null,"pKa4 = logKpn-3",{"$f":"IF(VLOOKUP(K$2,Database!$B$22:$N$301,7)=\"\",\"\",VLOOKUP(K$2,Database!$B$22:$N$301,7))","v":3.11},{"$f":"IF(VLOOKUP(L$2,Database!$B$22:$N$301,7)=\"\",\"\",VLOOKUP(L$2,Database!$B$22:$N$301,7))","v":""},{"$f":"IF(VLOOKUP(M$2,Database!$B$22:$N$301,7)=\"\",\"\",VLOOKUP(M$2,Database!$B$22:$N$301,7))","v":""},{"$f":"IF(VLOOKUP(N$2,Database!$B$22:$N$301,7)=\"\",\"\",VLOOKUP(N$2,Database!$B$22:$N$301,7))","v":""},{"$f":"IF(VLOOKUP(O$2,Database!$B$22:$N$301,7)=\"\",\"\",VLOOKUP(O$2,Database!$B$22:$N$301,7))","v":""},{"$f":"IF(VLOOKUP(P$2,Database!$B$22:$N$301,7)=\"\",\"\",VLOOKUP(P$2,Database!$B$22:$N$301,7))","v":""},{"$f":"IF(VLOOKUP(Q$2,Database!$B$22:$N$301,7)=\"\",\"\",VLOOKUP(Q$2,Database!$B$22:$N$301,7))","v":""}]
["[H5B]",null,null,null,null,null,null,null,"Total","pKa5",6.75,"","","","","","",null,null,null,"bp5",{"$f":"IF(K9=\"\",\"\",IF(K10=\"\",V8*10^K5,V8*10^K6))","v":3.9810717055349867E+24},"","","","","","",null,null,null,"pKa5 = logKpn-4",{"$f":"IF(VLOOKUP(K$2,Database!$B$22:$N$301,8)=\"\",\"\",VLOOKUP(K$2,Database!$B$22:$N$301,8))","v":6.75},{"$f":"IF(VLOOKUP(L$2,Database!$B$22:$N$301,8)=\"\",\"\",VLOOKUP(L$2,Database!$B$22:$N$301,8))","v":""},{"$f":"IF(VLOOKUP(M$2,Database!$B$22:$N$301,8)=\"\",\"\",VLOOKUP(M$2,Database!$B$22:$N$301,8))","v":""},{"$f":"IF(VLOOKUP(N$2,Database!$B$22:$N$301,8)=\"\",\"\",VLOOKUP(N$2,Database!$B$22:$N$301,8))","v":""},{"$f":"IF(VLOOKUP(O$2,Database!$B$22:$N$301,8)=\"\",\"\",VLOOKUP(O$2,Database!$B$22:$N$301,8))","v":""},{"$f":"IF(VLOOKUP(P$2,Database!$B$22:$N$301,8)=\"\",\"\",VLOOKUP(P$2,Database!$B$22:$N$301,8))","v":""},{"$f":"IF(VLOOKUP(Q$2,Database!$B$22:$N$301,8)=\"\",\"\",VLOOKUP(Q$2,Database!$B$22:$N$301,8))","v":""}]
["[H6B]",null,null,null,null,null,null,null,"SS","pKa6",11.03,"","","","","","",null,null,null,"bp6",{"$f":"IF(K10=\"\",\"\",V9*10^K5)","v":2.4547089156850394E+24},"","","","","","",null,null,null,"pKa6 = logKpn-5",{"$f":"IF(VLOOKUP(K$2,Database!$B$22:$N$301,9)=\"\",\"\",VLOOKUP(K$2,Database!$B$22:$N$301,9))","v":11.03},{"$f":"IF(VLOOKUP(L$2,Database!$B$22:$N$301,9)=\"\",\"\",VLOOKUP(L$2,Database!$B$22:$N$301,9))","v":""},{"$f":"IF(VLOOKUP(M$2,Database!$B$22:$N$301,9)=\"\",\"\",VLOOKUP(M$2,Database!$B$22:$N$301,9))","v":""},{"$f":"IF(VLOOKUP(N$2,Database!$B$22:$N$301,9)=\"\",\"\",VLOOKUP(N$2,Database!$B$22:$N$301,9))","v":""},{"$f":"IF(VLOOKUP(O$2,Database!$B$22:$N$301,9)=\"\",\"\",VLOOKUP(O$2,Database!$B$22:$N$301,9))","v":""},{"$f":"IF(VLOOKUP(P$2,Database!$B$22:$N$301,9)=\"\",\"\",VLOOKUP(P$2,Database!$B$22:$N$301,9))","v":""},{"$f":"IF(VLOOKUP(Q$2,Database!$B$22:$N$301,9)=\"\",\"\",VLOOKUP(Q$2,Database!$B$22:$N$301,9))","v":""}]
["S[HiB]",{"$f":"SUM(B4:B10)","v":0},{"$f":"SUM(C4:C10)","v":0.05},0,0,0,0,0,{"$f":"SUM(B11:H11)","v":0.05},"pKw",13.997,null,null,null,null,null,null,null,null,null,"Kw",{"$f":"10^-K11","v":1.0069316688518014E-14}]
["S[H]",{"$f":"B5+2*B6+3*B7+4*B8+5*B9+6*B10","v":0},{"$f":"C5+2*C6+3*C7+4*C8+5*C9+6*C10","v":0.15000000000000002},0,0,0,0,0,{"$f":"SUM(B12:H12)","v":0.15000000000000002}]
["SziCi",{"$f":"K4*B4+(K4+1)*B5+(K4+2)*B6+(K4+3)*B7+(K4+4)*B8+(K4+5)*B9+(K4+6)*B10","v":0},{"$f":"L4*C4+(L4+1)*C5+(L4+2)*C6+(L4+3)*C7+(L4+4)*C8+(L4+5)*C9+(L4+6)*C10","v":0},0,0,0,0,0,{"$f":"SUM(B13:H13)","v":0}]
["TITRANT",{"$f":"R3","v":"Strong ACID"},{"$f":"S3","v":"Strong BASE"},{"$f":"T3","v":"Carbonic ac."},"Total",null,"Volume of titrand (in mL)",null,"  Counterions and other ions",null,{"$f":"IF(K17<>K16, \"error: K16><K17\",\"\")","v":""},{"$f":"IF(K20<>K19, \"error: K19><K20\",\"\")","v":""},"  Simulation of errors ",null," Davies equation parameters"]
["[B]",null,0.1,null,"Titrant(s)","SAMPLE","Water","Titrand","Sample (Titrand)","Minimum  (mol/L)","Extra in sample","Sum  (mol/L)","  (data dispersion)",null," for activity coefficient estimation"]
["[HB]",null,null,null,null,"Dispensed","Added","Initial volume","Cations (monov.)",{"$f":"IF(I13<0,-I13,0)","v":0},0,{"$f":"J16+K16","v":0},"S pH=",0,"A ",0.50900000000000001]
["[H2B]",null,null,null,"SS",20,0,{"$f":"F17+G17","v":20},"Anions (monov.)",{"$f":"IF(I13>0,I13,0)","v":0},0,{"$f":"J17+K17","v":0},"S Vol=",0,"b",0.3]
["S[HiB]",{"$f":"SUM(B15:B17)","v":0},{"$f":"SUM(C15:C17)","v":0.1},{"$f":"SUM(D15:D17)","v":0},{"$f":"SUM(B18:D18)","v":0.1},null,"Maximum titrant volume & additions ",null,"     Titrant","Minimum  (mol/L)","Extra  (mol/L)","Sum  (mol/L)"]
["S[H]",{"$f":"B16+2*B17","v":0},{"$f":"C16+2*C17","v":0},{"$f":"D16+2*D17","v":0},{"$f":"SUM(B19:D19)","v":0},"Titrant Vol.","Number of additions ",null,"Cations (monov.)",{"$f":"IF(E20<0,-E20,0)","v":0.1},0,{"$f":"J19+K19","v":0.1},null,"I > 0.1 mol/L; the accuracy of pH calculation decreases with increasing I. Refer to comment in P15."]
["SziCi",{"$f":"R4*B15+(R4+1)*B16+(R4+2)*B17","v":0},{"$f":"S4*C15+(S4+1)*C16+(S4+2)*C17","v":-0.1},{"$f":"T4*D15+(T4+1)*D16+(T4+2)*D17","v":0},{"$f":"SUM(B20:D20)","v":-0.1},50,50,"Upper limits","Anions (monov.)",{"$f":"IF(E20>0,E20,0)","v":0},0,{"$f":"J20+K20","v":0}]
[2]
[" ",null,null,null,null,null,null,null,null,null,null,null,null,null,"Color  coding"]
[null,null,null,null,null,null,null,null,null,null,null,null,null,null,"D  o     n  o  t     c  h  a  n  g  e "]
[null,null,null,null,null,null,null,null,null,null,null,null,null,null," C h a n g e   c r i t e r i o u s l y"]
[null,null,null,null,null,null,null,null,null,null,null,null,null,null,"Fill out, change or leave blank"]
[null,null,null,null,null,null,null,null,null,null,null,null,null," Data ID on curves"]
[null,null,null,null,null,null,null,null,null,null,null,null,null," Copying curves"]
[null,null,null,null,null,null,null,null,null,null,null,null,null," Resizing axis"]
[null,null,null,null,null,null,null,null,null,null,null,null,null," Other graphics"]
[null,null,null,null,null,null,null,null,null,null,null,null,null," Data analysis"]
[]
[]
[]
[]
[]
[]
[null,null,null,null,null,null,null,null,null,null,null,null,null,null,null,null,null,null,null,null,null,null,null,null,null,null,null,null,null,null,null,null,null,null,null,null,null,null,null,null,null,null,null,null,null,null,null,null,"     Curve copied",null,"     Curve copied"]
[null,null,null,null,null,null,null,null,null,null,null,null,null,null,null,null,null,null,null,null,null,null,null,null,null,null,null,null,null,null,null,null,null,null,null,null,null,null,null,null,null,null,null,null,null,null,null,null,"      from Evaluation",null,"      from Regression",null,"Retained formed curves  "]
["Vadd",{"$f":"IF(A21=2,\"pH\", \"'pH'\")","v":"pH"},"Vadd",{"$f":"IF(A21=2,\"pH\", \"'pH'\")","v":"pH"},"[H]","CHtot =","Dil. factor","Dil. Factor","h1","h2","h3","h4","h5","h6","h7","h1 titrant","h2 titrant","h3 titrant","Parameters calculated only for the 'Activities, plot pH' option",null,null,null,null,null,null,null,null,null,null,null,null,null,null,null,null,null,null,null,null,null,null,null,null,null,null,null,null,null,"Vol","pH","Vol","pH","Vol","pH","Vol","pH","Vol","pH","Vol","pH","Vol","pH","Vol","pH","Vol","pH","Vol","pH","Vol","pH","Vol","pH","Vol","pH","Vol","pH","Vol","pH"]
["(mL)","simulated","with \"error\" \n(do not use)","simulated with \"error\"",null,"CHcalc","Titrand (sample)","Titrant (buret)",{"$f":"K3","v":"EDTA"},"Phosphoric acid","L-Glutamic acid ","Acetic acid","Ammonia","HCl","Carbonic acid","Strong ACID","Strong BASE","Carbonic ac.","Ionic strength, I","I of counter- and extra ions","gH+","pH",null,null,null,null,null,null,null,null,null,null,null,null,null,null,null,null,null,null,null,null,null,null,null,null,null,null,null,null,null,null,1,1,2,2,3,3,4,4,5,5,6,6,7,7,8,8,9,9,10,10,11,11,12,12,13,13]
[0,1.8171072203323106,null,null,1.7357856752656456E-2,0.15000000392439017,1,0,null,2.6528429434497318,null,null,null,null,null,null,0.99999999999998657,null,1.7357961286686194E-2,0,0.87780223435735738,1.7605039000095966,null,null,null,null,null,null,null,null,null,null,null,null,null,null,null,null,null,null,null,null,null,null,null,null,null,null,null,null,null,null,0,3.353082640741027,0,1.3864116955262979]
[2.3004442699983274,2.032047786974347,null,null,1.0695068602377461E-2,0.13452646788409006,0.89684311915668358,0.10315688084331645,null,2.5314507916472633,null,null,null,null,null,null,0.99999999999997768,null,2.1010975042030127E-2,5.1578440421658229E-3,0.86849763637200172,1.9708164253478602,null,null,null,null,null,null,null,null,null,null,null,null,null,null,null,null,null,null,null,null,null,null,null,null,null,null,null,null,null,null,0.68944716913392767,3.5408274918499165,3.1178095916402526,1.6072509629846639]
[4.3254293806277717,2.2461395606251631,null,null,6.5897820243305504E-3,0.12332773054295963,0.82218487028430232,0.17781512971569774,null,2.4071577847182537,null,null,null,null,null,null,0.99999999999996314,null,2.4371720628274859E-2,8.8907564857848877E-3,0.86097272332175656,2.1811289506861238,null,null,null,null,null,null,null,null,null,null,null,null,null,null,null,null,null,null,null,null,null,null,null,null,null,null,null,null,null,null,1.4582087154849432,3.7289556504310046,5.4830842549563386,1.8295767720077105]
[5.9982885514807629,2.4592836841503636,null,null,4.0603037477045098E-3,0.11539221099547332,0.76928140713558157,0.23071859286441851,null,2.2946101945542652,null,null,null,null,null,null,0.99999999999993949,null,2.7132952420871277E-2,1.1535929643220926E-2,0.85537744544511207,2.3914414760243874,null,null,null,null,null,null,null,null,null,null,null,null,null,null,null,null,null,null,null,null,null,null,null,null,null,null,null,null,null,null,2.3542375754914246,3.9171403658690189,7.1361621594405733,2.0529474593634975]
[7.2857924010771136,2.6715840410539862,null,null,2.50176204049755E-3,0.10994732920802602,0.73298219469406134,0.2670178053059386,null,2.2031582002122261,null,null,null,null,null,null,0.99999999999990086,null,2.9204946895041845E-2,1.3350890265296931E-2,0.8514712001486715,2.6017540013626514,null,null,null,null,null,null,null,null,null,null,null,null,null,null,null,null,null,null,null,null,null,null,null,null,null,null,null,null,null,null,3.3856183566967957,4.104981039261852,8.2263623175094835,2.2770093808906511]
[8.2150730798798275,2.8832299216443498,null,null,1.5414643081352935E-3,0.10632614671927186,0.70884097812451563,0.29115902187548431,null,2.1350001641515237,null,null,null,null,null,null,0.99999999999983802,null,3.0659788563283712E-2,1.4557951093774217E-2,0.84886105293054914,2.8120665267009151,null,null,null,null,null,null,null,null,null,null,null,null,null,null,null,null,null,null,null,null,null,null,null,null,null,null,null,null,null,null,4.5085039237164892,4.2921165891014637,8.9180936905904673,2.5015107349928822]
[8.8526467421235893,3.0944105888088806,null,null,9.4977546816661196E-4,0.103976596212093,0.69317730809079925,0.3068226919092007,null,2.087331790102688,null,null,null,null,null,null,0.9999999999997361,null,3.1636132747354329E-2,1.5341134595460035E-2,0.84716589970197553,3.0223790520391787,null,null,null,null,null,null,null,null,null,null,null,null,null,null,null,null,null,null,null,null,null,null,null,null,null,null,null,null,null,null,5.6376073000137694,4.478332619621276,9.346292847476434,2.7262844425341055]
[9.2745251162433426,3.3052786275549613,null,null,5.8520553163007882E-4,0.10247817814295154,0.68318785412551275,0.31681214587448719,null,2.0554158749731948,null,null,null,null,null,null,0.99999999999957057,null,3.2273221649580255E-2,1.584060729372436E-2,0.84608296827883944,3.2326915773774427,null,null,null,null,null,null,null,null,null,null,null,null,null,null,null,null,null,null,null,null,null,null,null,null,null,null,null,null,null,null,6.6790875498554669,4.6635941782915484,9.6073197331861593,2.9512243027203571]
[9.5472192681178587,3.5159444786081178,null,null,3.605752367046475E-4,0.10153239710035901,0.67688264734883086,0.3231173526511692,null,2.0346240787037564,null,null,null,null,null,null,0.999999999999302,null,3.2683521578861383E-2,1.6155867632558461E-2,0.84539490683982232,3.4430041027157063,null,null,null,null,null,null,null,null,null,null,null,null,null,null,null,null,null,null,null,null,null,null,null,null,null,null,null,null,null,null,7.5649809048627503,4.8480013819512893,9.7649527495377697,3.1762645496567417]
[9.7213897880461388,3.7264837480225905,null,null,2.2216895483277414E-4,0.10093740639297442,0.67291604270954875,0.32708395729045131,null,2.0212578525778881,null,null,null,null,null,null,0.99999999999886591,null,3.2948934281605932E-2,1.6354197864522566E-2,0.8449536434663556,3.6533166280539699,null,null,null,null,null,null,null,null,null,null,null,null,null,null,null,null,null,null,null,null,null,null,null,null,null,null,null,null,null,null,8.2683403175906278,5.031717381531374,9.8596074545639567,3.4013650938911701]
[9.8327682232089035,3.9369471828142366,null,null,1.3688972360550086E-4,0.10056056405979136,0.67040376040064109,0.32959623959935896,null,2.0126393813511703,null,null,null,null,null,null,0.99999999999815814,null,3.3126498120028158E-2,1.6479811979967948E-2,0.84466008842194706,3.8636291533922336,null,null,null,null,null,null,null,null,null,null,null,null,null,null,null,null,null,null,null,null,null,null,null,null,null,null,null,null,null,null,8.7971470828051679,5.2149114594288255,9.9162514918134548,3.6265017280784404]
[9.9056407354660756,4.1473695043515209,null,null,8.4344801652845916E-5,0.10031552329620627,0.6687701553333163,0.33122984466668365,null,2.0069135460135303,null,null,null,null,null,null,0.99999999999700917,null,3.3256150426479558E-2,1.6561492233334182E-2,0.84444657260448763,4.0739416787304972,null,null,null,null,null,null,null,null,null,null,null,null,null,null,null,null,null,null,null,null,null,null,null,null,null,null,null,null,null,null,9.1788289413671009,5.3977294222803902,9.9500796364736743,3.8516599176710975]
[9.9565126243025528,4.3577763800284215,null,null,5.1969171815699719E-5,0.10014516835185062,0.66763445568009061,0.33236554431990928,null,2.0027919305612265,null,null,null,null,null,null,0.99999999999514377,null,3.336787635259808E-2,1.6618277215995465E-2,0.84426313678787235,4.2842542040687608,null,null,null,null,null,null,null,null,null,null,null,null,null,null,null,null,null,null,null,null,null,null,null,null,null,null,null,null,null,null,9.4463911591446958,5.5802847581417367,9.9702573395916261,4.0768309653786892]
[9.9971799855994892,4.568189978170067,null,null,3.2020880555578243E-5,0.10000940092717606,0.6667293394872551,0.33327066051274495,null,1.9993214784352054,null,null,null,null,null,null,0.99999999999211475,null,3.3487884398105516E-2,1.6663533025637247E-2,0.84406667536987556,4.4945667294070244,null,null,null,null,null,null,null,null,null,null,null,null,null,null,null,null,null,null,null,null,null,null,null,null,null,null,null,null,null,null,9.6302381294663064,5.7626606426347093,9.9822841104469262,4.3020096773616689]
[10.037190472327598,4.7786338760517859,null,null,1.9729711975992238E-5,9.9876185246779423E-2,0.66584123499917303,0.33415876500082703,null,1.9956883491006818,null,null,null,null,null,null,0.99999999998719469,null,3.3644367357541803E-2,1.6707938250041351E-2,0.84381138681261092,4.704879254745288,null,null,null,null,null,null,null,null,null,null,null,null,null,null,null,null,null,null,null,null,null,null,null,null,null,null,null,null,null,null,9.7549627986154519,5.9449158555196302,9.9894494880572893,4.5271929557213983]
[10.085949602359053,4.9891381108161532,null,null,1.2156490636788552E-5,9.9714319777955793E-2,0.66476213179869814,0.33523786820130186,null,1.9910393347218676,null,null,null,null,null,null,0.99999999997919897,null,3.3873735427049419E-2,1.6761893410065093E-2,0.84343898767314673,4.9151917800835516,null,null,null,null,null,null,null,null,null,null,null,null,null,null,null,null,null,null,null,null,null,null,null,null,null,null,null,null,null,null,9.8390408456907608,6.1270910859581083,9.9937174454680644,4.7523789540175265]
[10.15480393873016,5.1997450185032132,null,null,7.4902393295022055E-6,9.9486635894382155E-2,0.66324423929488052,0.33675576070511953,null,1.9842937964427327,null,null,null,null,null,null,0.9999999999661946,null,3.4228304434082597E-2,1.6837788035255978E-2,0.84286746439138982,5.1255043054218152,null,null,null,null,null,null,null,null,null,null,null,null,null,null,null,null,null,null,null,null,null,null,null,null,null,null,null,null,null,null,9.8957675087149255,6.309214284576151,9.9962592605152167,4.9775665722206686]
[10.259427891646595,5.4105160250212876,null,null,4.6151218217071628E-6,9.9142654333944716E-2,0.66095102887966894,0.339048971120331,null,1.9739176528750595,null,null,null,null,null,null,0.99999999994501865,null,3.4786262861466369E-2,1.6952448556016551E-2,0.84197812556355434,5.3358168307600788,null,null,null,null,null,null,null,null,null,null,null,null,null,null,null,null,null,null,null,null,null,null,null,null,null,null,null,null,null,null,9.9345023700152524,6.4913047943471502,9.9977730118553154,5.202755155161106]
[10.422738778845892,5.6215381679324095,null,null,2.843614001131413E-6,9.8610451274028149E-2,0.65740300849924715,0.3425969915007529,null,1.9576397641129131,null,null,null,null,null,null,0.9999999999104745,null,3.5663818868037822E-2,1.7129849575037645E-2,0.84060349472962048,5.5461293560983425,null,null,null,null,null,null,null,null,null,null,null,null,null,null,null,null,null,null,null,null,null,null,null,null,null,null,null,null,null,null,9.9618181542609818,6.6733764198713299,9.9986746281501837,5.427944312752996]
[10.678157280989179,5.832925773374515,null,null,1.7520968892733309E-6,9.7789445839954414E-2,0.6519296389001491,0.3480703610998509,null,1.9321307715950855,null,null,null,null,null,null,0.99999999985398091,null,3.7026349141787436E-2,1.7403518054992545E-2,0.83852518506197904,5.756441881436607,null,null,null,null,null,null,null,null,null,null,null,null,null,null,null,null,null,null,null,null,null,null,null,null,null,null,null,null,null,null,9.9824373712181114,6.8554397171627715,9.9992118965019472,5.6531338128240902]
[11.071774958241141,6.0448064788874438,null,null,1.0795570383954587E-6,9.6550647741314902E-2,0.643670985223051,0.35632901477694895,null,1.8927893745460747,null,null,null,null,null,null,0.99999999976129661,null,3.9087447616485686E-2,1.781645073884745E-2,0.83550284110700646,5.9667544067748706,null,null,null,null,null,null,null,null,null,null,null,null,null,null,null,null,null,null,null,null,null,null,null,null,null,null,null,null,null,null,9.999968706688378,7.0375037897783503,9.9995325042982586,5.8783235173525084]
[11.659035151734244,6.2572748251870589,null,null,6.6517063427498744E-7,9.4759678731593702E-2,0.63173119154141022,0.36826880845858984,null,1.8340761199428226,null,null,null,null,null,null,0.99999999960872443,null,4.2070224023931589E-2,1.8413440422929493E-2,0.83136571434460926,6.1770669321131342,null,null,null,null,null,null,null,null,null,null,null,null,null,null,null,null,null,null,null,null,null,null,null,null,null,null,null,null,null,null,10.017501802940387,7.2195778494024481,9.9997245837585069,6.1035133445166174]
[12.487507127567198,6.4703072866018667,null,null,4.0984585062721997E-7,9.2343188636150653E-2,0.61562125777970345,0.38437874222029655,null,1.7512371415442896,null,null,null,null,null,null,0.99999999935696426,null,4.6096404997134063E-2,1.9218937111014828E-2,0.82617523794672942,6.3873794574513978,null,null,null,null,null,null,null,null,null,null,null,null,null,null,null,null,null,null,null,null,null,null,null,null,null,null,null,null,null,null,10.038132137560751,7.4016727738094703,9.9998409408726729,6.3287032462111243]
[13.560292328145474,6.6836852106454243,null,null,2.5252711503031824E-7,8.9391354833207357E-2,0.59594236554634206,0.40405763445365794,null,1.6439642819228899,null,null,null,null,null,null,0.99999999894153024,null,5.101537443806016E-2,2.0202881722682899E-2,0.82036434309113881,6.5976919827896614,null,null,null,null,null,null,null,null,null,null,null,null,null,null,null,null,null,null,null,null,null,null,null,null,null,null,null,null,null,null,10.065490762644913,7.583802879029677,9.9999135694815777,6.5538931948217449]
[14.799194160378374,6.8970304272299172,null,null,1.5559494802239259E-7,8.6208892830705749E-2,0.57472595221103062,0.42527404778896927,null,1.5200785652539486,null,null,null,null,null,null,0.99999999825796715,null,5.6319077984233731E-2,2.1263702389448465E-2,0.81465566990040217,6.808004508127925,null,null,null,null,null,null,null,null,null,null,null,null,null,null,null,null,null,null,null,null,null,null,null,null,null,null,null,null,null,null,10.104356806550641,7.7659881028362863,9.9999624319025315,6.7790831756342191]
[16.054576035651355,7.109980438221382,null,null,9.5870052794863011E-8,8.3207191148021692E-2,0.55471460764776159,0.44528539235223846,null,1.3945447201148788,null,null,null,null,null,null,0.99999999713817,null,6.1321753813883398E-2,2.2264269617611923E-2,0.80972323018237757,7.0183170334661886,null,null,null,null,null,null,null,null,null,null,null,null,null,null,null,null,null,null,null,null,null,null,null,null,null,null,null,null,null,null,10.161435448389966,7.9482567330789253,10.000000968284439,7.0042731827829474]
[17.173922387612194,7.3223490687109374,null,null,5.9070472015370839E-8,8.0701734100520173E-2,0.53801156066902833,0.46198843933097178,null,1.282615330196913,null,null,null,null,null,null,0.99999999531112593,null,6.5497538950118492E-2,2.309942196654859E-2,0.805898771755863,7.2286295588044522,null,null,null,null,null,null,null,null,null,null,null,null,null,null,null,null,null,null,null,null,null,null,null,null,null,null,null,null,null,null,10.24638257076731,8.1306486159801228,10.000039772421587,7.2294632176513396]
[18.068468956968598,7.5341386525923753,null,null,3.6396356968582683E-8,7.8805375739173955E-2,0.52536917158804963,0.47463082841195037,null,1.1931680593272778,null,null,null,null,null,null,0.99999999233812242,null,6.8658336351484106E-2,2.373154142059752E-2,0.80316252314550274,7.4389420841427167,null,null,null,null,null,null,null,null,null,null,null,null,null,null,null,null,null,null,null,null,null,null,null,null,null,null,null,null,null,null,10.373125404294115,8.3132182670395611,10.000089510867838,7.454653289233244]
[18.72548397870122,7.7454546504042199,null,null,2.2425668111130016E-8,7.7468366842731715E-2,0.5164557791195038,0.4835442208804962,null,1.1274778362819156,null,null,null,null,null,null,0.99999998750734698,null,7.0887101885767953E-2,2.4177211044024812E-2,0.80130889365311475,7.6492546094809803,null,null,null,null,null,null,null,null,null,null,null,null,null,null,null,null,null,null,null,null,null,null,null,null,null,null,null,null,null,null,10.561402533494402,8.4960361896367385,10.000163859513123,7.6798434166235827]
[19.179874809847981,7.9564249206430109,null,null,1.3817607917865679E-8,7.6569923066119941E-2,0.51046615368510906,0.48953384631489089,null,1.0820566175153761,null,null,null,null,null,null,0.99999997966319665,null,7.2385238859882975E-2,2.4476692315744546E-2,0.80009621902040151,7.859567134819244,null,null,null,null,null,null,null,null,null,null,null,null,null,null,null,null,null,null,null,null,null,null,null,null,null,null,null,null,null,null,10.838089119351935,8.6791847181656561,10.000283257977571,7.9050336342567364]
[19.481817374377648,8.167159454690637,null,null,8.5137391504115883E-9,7.5984344173040452E-2,0.50656229448402945,0.49343770551597066,null,1.0518910771500245,null,null,null,null,null,null,0.99999996692961679,null,7.3362420505331802E-2,2.4671885275798534E-2,0.79931913439604474,8.0698796601575076,null,null,null,null,null,null,null,null,null,null,null,null,null,null,null,null,null,null,null,null,null,null,null,null,null,null,null,null,null,null,11.237055245146621,8.8627423063257744,10.000480541202705,8.1302240013857006]
[19.67773416286737,8.3777400369887793,null,null,5.2457527201602014E-9,7.5609156192147392E-2,0.50406104123793205,0.49593895876206806,null,1.0323458341872529,null,null,null,null,null,null,0.99999994626121325,null,7.3989726537380687E-2,2.4796947938103404E-2,0.79882592771976335,8.2801921854957712,null,null,null,null,null,null,null,null,null,null,null,null,null,null,null,null,null,null,null,null,null,null,null,null,null,null,null,null,null,null,11.794926707807463,9.04675039255517,10.000809955818113,8.3554146183559563]
[19.803712505226017,8.5882232207093221,null,null,3.2321781434586033E-9,7.5369853992644759E-2,0.50246569327112778,0.49753430672887222,null,1.0198232691848867,null,null,null,null,null,null,0.99999991271458422,null,7.4391807037924876E-2,2.4876715336443613E-2,0.798512086399777,8.4905047108340348,null,null,null,null,null,null,null,null,null,null,null,null,null,null,null,null,null,null,null,null,null,null,null,null,null,null,null,null,null,null,12.539179688610602,9.231166912280317,10.001362081675325,8.5806056541966989]
[19.885540108308714,8.798646878983913,null,null,1.9915112488818308E-9,7.5215228127685732E-2,0.50143485447834568,0.49856514552165426,null,1.0117626302747456,null,null,null,null,null,null,0.99999985826521398,null,7.4654782996030039E-2,2.4928257276082715E-2,0.79830777886229876,8.7008172361722984,null,null,null,null,null,null,null,null,null,null,null,null,null,null,null,null,null,null,null,null,null,null,null,null,null,null,null,null,null,null,13.468123345228378,9.4158342111909406,10.002288770920131,8.8057973930797129]
[19.941073821819778,9.009036446165327,null,null,1.2270725431547262E-9,7.5110649587512138E-2,0.50073766392014263,0.49926233607985732,null,1.0064075009814757,null,null,null,null,null,null,0.99999976988600991,null,7.4837619266396246E-2,2.4963116803992866E-2,0.79816617530088507,8.911129761510562,null,null,null,null,null,null,null,null,null,null,null,null,null,null,null,null,null,null,null,null,null,null,null,null,null,null,null,null,null,null,14.532993528700899,9.60050443993714,10.003844932361972,9.0309903124075408]
[19.982924715427686,9.2194098816679926,null,null,7.5606252639025419E-10,7.5032029829494529E-2,0.50021353221023535,0.49978646778976471,null,1.0025443327295511,null,null,null,null,null,null,0.99999962642542906,null,7.4982480392023695E-2,2.4989323389488238E-2,0.79805423968131639,9.1214422868488256,null,null,null,null,null,null,null,null,null,null,null,null,null,null,null,null,null,null,null,null,null,null,null,null,null,null,null,null,null,null,15.64163693547016,9.7849285539922946,10.006458779389504,9.2561852139633451]
[20.02083246216479,9.4297815038007933,null,null,4.658490217228622E-10,7.4960959465488905E-2,0.49973972977468067,0.50026027022531938,null,0.99927655774245971,null,null,null,null,null,null,0.999999393531953,null,7.5123290074031956E-2,2.5013013511265971E-2,0.79794565152555419,9.3317548121870892,null,null,null,null,null,null,null,null,null,null,null,null,null,null,null,null,null,null,null,null,null,null,null,null,null,null,null,null,null,null,16.690479229146149,9.9689466492654955,10.010849985701498,9.4813834440142948]
[20.063731152131702,9.6401651663066854,null,null,2.8703355009044805E-10,7.4880694177105689E-2,0.49920462784437075,0.50079537215562919,null,0.99583692660796641,null,null,null,null,null,null,0.99999901539381497,null,7.5293130495628871E-2,2.5039768607781461E-2,0.79781495923039991,9.5420673375253529,null,null,null,null,null,null,null,null,null,null,null,null,null,null,null,null,null,null,null,null,null,null,null,null,null,null,null,null,null,null,17.603331759164575,10.152515464383894,10.018228740955237,9.7065872625598999]
[20.121755055457047,9.8505772939239424,null,null,1.7685613800975045E-10,7.4772402050957434E-2,0.4984826803082007,0.50151731969179936,null,0.99141820179504692,null,null,null,null,null,null,0.99999840127405593,null,7.5531561718069865E-2,2.5075865984589968E-2,0.79763200716288241,9.7523798628636165,null,null,null,null,null,null,null,null,null,null,null,null,null,null,null,null,null,null,null,null,null,null,null,null,null,null,null,null,null,null,18.35030156216817,10.335676962617459,10.03063188836677,9.9318004621133511]
[20.208536056861433,10.061040233181268,null,null,1.0897016582858609E-10,7.4611022787328132E-2,0.49740681858490782,0.50259318141509213,null,0.98499558489212025,null,null,null,null,null,null,0.99999740350827659,null,7.5893027376269143E-2,2.5129659070754609E-2,0.79735580246167992,9.9626923882018801,null,null,null,null,null,null,null,null,null,null,null,null,null,null,null,null,null,null,null,null,null,null,null,null,null,null,null,null,null,null,18.942612658429425,10.518511475237084,10.051492501224857,10.157029403192565]
[20.344214425694414,10.27158617793776,null,null,6.7142125652743168E-11,7.4360104477559683E-2,0.49573402989010495,0.50426597010989493,null,0.97511397302740999,null,null,null,null,null,null,0.99999578142667422,null,7.6457324853846001E-2,2.5213298505494749E-2,0.79692736433869771,10.173004913540144,null,null,null,null,null,null,null,null,null,null,null,null,null,null,null,null,null,null,null,null,null,null,null,null,null,null,null,null,null,null,19.416979695961345,10.701104280413743,10.086610914731864,10.38228474269382]
[20.559627960521674,10.48226134941582,null,null,4.1369718058978618E-11,7.3965175463378705E-2,0.49310116994827491,0.50689883005172509,null,0.95962168115098412,null,null,null,null,null,null,0.99999314192431665,null,7.7342219671164461E-2,2.5344941502586257E-2,0.79626218896963086,10.383317438878407,null,null,null,null,null,null,null,null,null,null,null,null,null,null,null,null,null,null,null,null,null,null,null,null,null,null,null,null,null,null,19.822495484550018,10.883530080759435,10.145826595544349,10.607584306646606]
[20.902049192146301,10.69312859620427,null,null,2.5490011757014698E-11,7.3345958432753919E-2,0.48897305621005716,0.51102694378994284,null,0.93536730870759333,null,null,null,null,null,null,0.99998884107460939,null,7.871539697196156E-2,2.5551347189497142E-2,0.79524577788399853,10.593629964216671,null,null,null,null,null,null,null,null,null,null,null,null,null,null,null,null,null,null,null,null,null,null,null,null,null,null,null,null,null,null,20.215055385779124,11.065849475536167,10.245943551126402,10.832957830787768]
[21.44228569471289,10.904263365785328,null,null,1.5705707697752415E-11,7.2389829605858241E-2,0.4825988639621423,0.51740113603785765,null,0.89798277291422324,null,null,null,null,null,null,0.99998182073423547,null,8.0795532166209522E-2,2.5870056801892884E-2,0.79374157357907027,10.803942489554935,null,null,null,null,null,null,null,null,null,null,null,null,null,null,null,null,null,null,null,null,null,null,null,null,null,null,null,null,null,null,20.659375215473119,11.248111321477786,10.415984124119859,11.058454687920037]
[22.281442626859544,11.115733445460259,null,null,9.6770945670261418E-12,7.0953113521420738E-2,0.47302075703762481,0.52697924296237519,null,0.84212579527609799,null,null,null,null,null,null,0.99997033809868729,null,8.3817936516434877E-2,2.634896214811876E-2,0.79162877772131968,11.014255014893198,null,null,null,null,null,null,null,null,null,null,null,null,null,null,null,null,null,null,null,null,null,null,null,null,null,null,null,null,null,null,21.238175708276685,11.430357396969191,10.707017914683092,11.284156219807242]
[23.553723567065564,11.327553152423693,null,null,5.962555846660016E-12,6.8880448190332524E-2,0.45920298790635994,0.54079701209364017,null,0.76292727823368822,null,null,null,null,null,null,0.99995152501276718,null,8.7926940438776885E-2,2.703985060468201E-2,0.78888625987316252,11.224567540231462,null,null,null,null,null,null,null,null,null,null,null,null,null,null,null,null,null,null,null,null,null,null,null,null,null,null,null,null,null,null,22.070677862211596,11.612627884233907,11.211729601200204,11.510194694607463]
[25.425947284175155,11.539624052110103,null,null,3.6738374290233909E-12,6.6041550164391949E-2,0.44027700456930957,0.55972299543069048,null,0.6592911713459394,null,null,null,null,null,null,0.99992068897101305,null,9.2987097586830658E-2,2.7986149771534526E-2,0.78569866945925826,11.434880065569725,null,null,null,null,null,null,null,null,null,null,null,null,null,null,null,null,null,null,null,null,null,null,null,null,null,null,null,null,null,null,23.348587220243644,11.794967391156714,12.107096232648473,11.736780505153671]
[28.122491988603517,11.75171816931954,null,null,2.2636402579698634E-12,6.2340911200312626E-2,0.41560607469655664,0.58439392530344347,null,0.53773219880036927,null,null,null,null,null,null,0.99987022609431842,null,9.8431976839077923E-2,2.9219696265172176E-2,0.7824821260269792,11.645192590907989,null,null,null,null,null,null,null,null,null,null,null,null,null,null,null,null,null,null,null,null,null,null,null,null,null,null,null,null,null,null,25.413084276078735,11.977431804206329,13.760415789147373,11.964236064627583]
[32.065280894638896,11.963554363265594,null,null,1.3947452266182587E-12,5.7619971425255559E-2,0.38413314316833691,0.61586685683166309,null,0.41238444609826386,null,null,null,null,null,null,0.99978791425254765,null,0.10336566841056349,3.0793342841583155E-2,0.77974169418325612,11.855505116246253,null,null,null,null,null,null,null,null,null,null,null,null,null,null,null,null,null,null,null,null,null,null,null,null,null,null,null,null,null,null,28.945042788109276,12.160096419814815,17.047096470196266,12.193024702356251]
[38.317482636090951,12.174908796008481,null,null,8.5937429338664664E-13,5.1442549662562467E-2,0.34295033146068271,0.65704966853931734,null,0.298849217859118,null,null,null,null,null,null,0.99965418030131148,null,0.10689849826648898,3.2852483426965867E-2,0.77787327333990652,12.065817641584516,null,null,null,null,null,null,null,null,null,null,null,null,null,null,null,null,null,null,null,null,null,null,null,null,null,null,null,null,null,null,35.536279213556554,12.343065535500466,24.627392178808805,12.423738905573176]
[50,12.385644648704332,null,null,5.2950471673199133E-13,4.2855511206788537E-2,0.28573108354400611,0.71426891645599389,null,0.20703356942426254,null,null,null,null,null,null,0.99943776888184777,null,0.10837293667005463,3.5713445822799693E-2,0.77711541294751063,12.27613016692278,null,null,null,null,null,null,null,null,null,null,null,null,null,null,null,null,null,null,null,null,null,null,null,null,null,null,null,null,null,null,49.999999986903276,12.52648266198166,49.999999998544808,12.656969396779232]

{"sheet":"Distribution","index":5,"n_rows":82,"n_cols":64,"rows_kept":82,"cut":false,"hidden":false,"merged":[]}
[null,"         Distribution Diagrams, Buffer Capacity and Protonation Curves",null,null,null,null,null,"<--- read comment",null,null,null,null,null,null,null,null,null,null,null,null,null,null,null,null,null,"Do not change or delete"]
[null,null,null,"        Acid/base system",null,"   Overall protonation constants bp",null,"Corrected for I","Species","Curve color",null,null,null,"Color  coding",null,null,null,null,null,null,null,null,null,null,null,"Options of the K12 slider"]
[null,null,null,null,8,"Ionic strength, I ",0,{"$f":"IF(C7<0,0,IF(C7>3,3,C7))","v":0.1},"a B",null,null,null,null,"D  o     n  o  t     c  h  a  n  g  e ",null,null,null,null,null,null,null,null,null,null,null,"Titration curve from Titration"]
[null,null,null,"pKa1 = logKpn  ",{"$f":"IF(VLOOKUP(E$3,Database!$B$22:$N$301,4)=\"\",\"\",VLOOKUP(E$3,Database!$B$22:$N$301,4))","v":2.1480000000000001},"bp1",{"$f":"IF(E4=\"\",\"\",IF(E5=\"\",10^E4,(IF(E6=\"\",10^E5,(IF(E7=\"\",10^E6,(IF(E8=\"\",10^E7,(IF(E9=\"\",10^E8,10^E9))))))))))","v":2238721138568.3457},{"$f":"IF(G4=\"\",\"\",(G4*$H$10^(-2*$E$10)))","v":510372321828.43945},"a HB",null,null,null,null," C h a n g e   c r i t e r i o u s l y",null,null,null,null,null,null,null,null,null,null,null,"Titration curve from Simulation"]
[null,"of",null,"pKa2 = logKpn-1",{"$f":"IF(VLOOKUP(E$3,Database!$B$22:$N$301,5)=\"\",\"\",VLOOKUP(E$3,Database!$B$22:$N$301,5))","v":7.1989999999999998},"bp2",{"$f":"IF(E5=\"\",\"\",IF(E6=\"\",G4*10^E4,(IF(E7=\"\",G4*10^E5,(IF(E8=\"\",G4*10^E6,(IF(E9=\"\",G4*10^E7,G4*10^E8))))))))","v":3.539973410834362E+19},{"$f":"IF(G5=\"\",\"\",(G5*$H$10^(-4*$E$10-2)))","v":3.0117010241596421E+18},"a H2B",null,null,null,null,"Fill out, change or leave blank",null,null,null,null,null,null,null,null,null,null,null,"Titration curve from Evaluation"]
[null,{"$f":"IF(VLOOKUP(E$3,Database!$B$22:$N$301,2)=\"\",\"\",VLOOKUP(E$3,Database!$B$22:$N$301,2))","v":"Phosphoric acid"},null,"pKa3 = logKpn-2",{"$f":"IF(VLOOKUP(E$3,Database!$B$22:$N$301,6)=\"\",\"\",VLOOKUP(E$3,Database!$B$22:$N$301,6))","v":12.35},"bp3",{"$f":"IF(E6=\"\",\"\",IF(E7=\"\",G5*10^E4,(IF(E8=\"\",G5*10^E5,(IF(E9=\"\",G5*10^E6,G5*10^E7))))))","v":4.9773708497893867E+21},{"$f":"IF(G6=\"\",\"\",(G6*$H$10^(-6*$E$10-6)))","v":2.5868677582221171E+20},"a H3B",null,null,null,null,null,null,null,null,null,null,null,null,null,null,null,null,"Titration curve from Regression"]
[null,"at ionic strength I (mol/L)",0.1,"pKa4 = logKpn-3",{"$f":"IF(VLOOKUP(E$3,Database!$B$22:$N$301,7)=\"\",\"\",VLOOKUP(E$3,Database!$B$22:$N$301,7))","v":""},"bp4",{"$f":"IF(E7=\"\",\"\",IF(E8=\"\",G6*10^E4,(IF(E9=\"\",G6*10^E5,G6*10^E6))))","v":""},{"$f":"IF(G7=\"\",\"\",(G7*$H$10^(-8*$E$10-12)))","v":""},"a H4B",null,null,null," Data ID on curves",null,null,null,null,null,null,null,null,null,null,null,null,"No titration curve"]
[null,"and plot Buffer Capacity",null,"pKa5 = logKpn-4",{"$f":"IF(VLOOKUP(E$3,Database!$B$22:$N$301,8)=\"\",\"\",VLOOKUP(E$3,Database!$B$22:$N$301,8))","v":""},"bp5",{"$f":"IF(E8=\"\",\"\",IF(E9=\"\",G7*10^E4,G7*10^E5))","v":""},{"$f":"IF(G8=\"\",\"\",(G8*$H$10^(-10*$E$10-20)))","v":""},"a H5B",null,null,null," Copying curves"]
[null,"at S[HiB] (mol/L)",0.05,"pKa6 = logKpn-5",{"$f":"IF(VLOOKUP(E$3,Database!$B$22:$N$301,9)=\"\",\"\",VLOOKUP(E$3,Database!$B$22:$N$301,9))","v":""},"bp6",{"$f":"IF(E9=\"\",\"\",G8*10^E4)","v":""},{"$f":"IF(G9=\"\",\"\",(G9*$H$10^(-12*$E$10-30)))","v":""},"a H6B",null,null,null," Resizing axis",null,null,"Molar fraction of each species as a function of pH",null,null,null,null,null,null,null,null,null,"Molar fraction of each species during titration",null,null,null,null,null,null,null,null,null,null,null,null,"logarithm of molar fraction of each species as a function of pH",null,null,null,null,null,null,null,null,null,null,"logarithm of molar fraction of each species during titration",null,null,null,null,null,null,null,null,null,null,"Mean charge of species HiB"]
[null,{"$f":"IF(C9>C7,\"Generally C9 < C7\",\"\")","v":""},null,"Charge of B",{"$f":"IF(VLOOKUP(E$3,Database!$B$22:$N$301,3)=\"\",\"\",VLOOKUP(E$3,Database!$B$22:$N$301,3))","v":-3},"gH+",1,{"$f":"10^(-0.509*(H3^0.5/(1+H3^0.5)-0.3*H3))","v":0.78159394394683346},null,null,null,null,null,null,null,null,"alpha 0","alpha 1","alpha 2","alpha 3","alpha 4","alpha 5","alpha 6","Buffer",null,null,null,"alpha 0","alpha 1","alpha 2","alpha 3","alpha 4","alpha 5","alpha 6","scaling","scaling","scaling","Buffer",null,"log alpha 0","log alpha 1","log alpha 2","log alpha 3","log alpha 4","log alpha 5","log alpha 6","Buffer","same","same","log alpha 0","log alpha 1","log alpha 2","log alpha 3","log alpha 4","log alpha 5","log alpha 6","scaling","scaling","Buffer","vs",null,"vs",null,"scale"]
[null,{"$f":"IF(C7>0.1, \"Best accuracy for I < 0.1 mol/L\",\"\")","v":""},null,"Protonations, n",{"$f":"IF(E4=\"\",\"\",IF(E5=\"\",1,(IF(E6=\"\",2,(IF(E7=\"\",3,(IF(E8=\"\",4,(IF(E9=\"\",5,6))))))))))","v":3},"pKw",13.997,{"$f":"G11+LOG10(H10^2)","v":13.782962371327621},null,null,null,null,null,null,"pH","h","B","HB","H2B","H3B","H4B","H5B","H6B","Capacity","Vol","pH","h","B","HB","H2B","H3B","H4B","H5B","H6B","pH/14","n*pH/8","n*pH/6","Capacity","pH","B","HB","H2B","H3B","H4B","H5B","H6B","Capacity","Vol","pH","B","HB","H2B","H3B","H4B","H5B","H6B","pH (-8 a 0)","pH (-6 a 0)","Capacity","pH","zm","Vol","zm","z+N.pH/14"]
[null,null,"No Isoelectrc Point in the pH range of ","0 to 14","for",null,{"$f":"IF(VLOOKUP(E$3,Database!$B$22:$N$301,2)=\"\",\"\",VLOOKUP(E$3,Database!$B$22:$N$301,2))","v":"Phosphoric acid"},null,null,"Plot all curves overlaid on  ",2,null,null,null,0,2.9909825254290823,1.829091055273542E-21,1.1943765121842975E-9,9.0174721821650351E-3,0.99098252662345854,null,null,null,2.9470598353394553,0,1.8171072800722754,2.6260869886675571,3.2668417879467625E-16,3.2503247173949048E-6,0.37390651068300745,0.62609023899227489,null,null,null,0.12979337714801967,0.38938013144405897,6.4896688574009834E-2,7.1840897036083165E-2,0,null,-8.9228009792610283,-2.0449019499971892,-3.9339776221329632E-3,null,null,null,0.46938591477603636,0,0,-15.485771642394713,-5.4880377197815591,-0.42723420665833445,-0.20336175042389248,null,null,null,-6.9616529828158429,-3.4808264914079214,-1.1436208496845741,0,-9.0174745709177273E-3,1.8171072800722754,-0.37391301133244292,-2.6106198685559412]
[null,null,null,null,null,null,null,null,null,null,null,null,null,null,0.2,2.985783246577463,7.2435383431911843E-21,2.9843976661383275E-9,1.4216747453741053E-2,0.98578324956186125,null,null,null,1.8604334118625532,2.3004448812571354,2.03204784726322,2.5051316407982851,1.1633851356765297E-15,7.0563740093412916E-6,0.49485424645369247,0.50513869717229698,null,null,null,0.14514627480451572,0.43543882441354714,7.2573137402257862E-2,5.6145715881996808E-2,0.2,null,-8.5250881166298509,-1.8471877925683082,-6.2185253955491307E-3,null,null,null,0.26961238500444712,2.3004448812571354,0.2,-14.934179805055596,-5.1513850581106215,-0.30552072065557867,-0.29658744008931792,null,null,null,-6.8388298015638744,-3.4194149007819372,-1.2506752794435696,0.2,-1.4216753422537032E-2,2.03204784726322,-0.4948683592017149,-2.5645611755864528]
[null,null,null,null,null,null,null,null,null,null,null,null,null,null,0.4,2.9776537739493611,2.8599234805983471E-20,7.434646809223417E-9,2.2346211181345322E-2,0.97765378138400783,null,null,null,1.1753513038547314,4.3254298929241486,2.2461396194374883,2.3840296933706888,3.881228876256072E-15,1.437922775878907E-5,0.61594154817378177,0.38404407259845547,null,null,null,0.16043854424553489,0.48131563273660466,8.0219272122767443E-2,4.3952080409881279E-2,0.4,-19.543519061253633,-8.1286870329044589,-1.6507854140452141,-9.8148520747523334E-3,null,null,null,7.0167239170475265E-2,4.3254298929241486,0.4,-14.410937449290524,-4.8422330884921418,-0.21045913718369266,-0.41561624276402592,null,null,null,-6.7164916460357205,-3.3582458230178602,-1.3570117780499349,0.4,-2.2346226050638851E-2,2.2461396194374883,-0.61597030662931118,-2.5186843672633952]
[null,null,null,null,null,null,null,null,null,null,null,null,null,null,0.60000000000000009,2.9650405304631682,1.1238669265176895E-19,1.8434052464173964E-8,3.4959432668727204E-2,0.96504054889722035,null,null,null,0.74389371350979905,5.9982889695675112,2.4592837415154789,2.2762072864983911,1.2170238265135317E-14,2.760077441796993E-5,0.72373751195273617,0.27623488727283357,null,null,null,0.17566312439396278,0.52698937318188832,8.7831562196981391E-2,3.325461507161067E-2,0.60000000000000009,-18.949162431686879,-7.7343291085399981,-1.4564261948830513,-1.5454338114886345E-2,null,null,null,-0.12848827957092057,5.9982889695675112,0.60000000000000009,-13.914610835590624,-4.5590492169776367,-0.14041800785457997,-0.55871785562030563,null,null,null,-6.5946950048482975,-3.2973475024241488,-1.4781385053269342,0.60000000000000009,-3.4959469536831822E-2,2.4592837415154789,-0.7237927135016089,-2.4730106268181116]
[null,null,null,null,null,null,null,null,null,null,null,null,null,null,0.8,2.9457031781759282,4.3845416348057186E-19,4.5376409317351823E-8,5.4296731071253164E-2,0.94570322355233749,null,null,null,0.47282623367197241,7.2857926934375428,2.6715840969865385,2.189631424696652,3.6219904085004806E-14,5.0381271896018047E-5,0.8102678127594467,0.18968180596862091,null,null,null,0.19082743549903847,0.5724823064971154,9.5413717749519233E-2,2.3979353609321779E-2,0.8,-18.357956951614412,-7.3431223336698297,-1.2652181252151795,-2.4244973649311632E-2,null,null,null,-0.32529632965330663,7.2857926934375428,0.8,-13.440965686867617,-4.2977030492956256,-9.1370821213565503E-2,-0.72196965002028779,null,null,null,-6.4733805160076923,-3.2366902580038461,-1.6201520390662025,0.8,-5.4296821824071806E-2,2.6715840969865385,-0.81036857530334805,-2.4275176935028844]
[null,null,null,null,null,null,null,null,null,null,null,null,null,null,1,2.9165940469207148,1.6917898444844041E-18,1.1047203188590904E-7,8.3405732135221289E-2,0.91659415739274686,null,null,null,0.30340474636721804,8.2150732792797498,2.8832299762264122,2.1256197211122743,1.0356736030263798E-13,8.8490950361823202E-5,0.87420329698669108,0.12570821206284352,null,null,null,0.20594499830188659,0.61783499490565974,0.10297249915094329,1.6521035564471959E-2,1,-17.771538532880388,-6.9567026201381053,-1.0787971168857524,-3.7822670522181558E-2,null,null,null,-0.51797427615036951,8.2150732792797498,1,-12.984693029496828,-4.0530749009717182,-5.8387181936540286E-2,-0.90063051979014475,null,null,null,-6.3524400135849071,-3.1762200067924535,-1.7819511974955422,1,-8.3405953079285222E-2,2.8832299762264122,-0.87438027888772574,-2.3821650050943401]
[null,null,null,null,null,null,null,null,null,null,null,null,null,null,1.2,2.8739590030275246,6.4218553806404168E-18,2.6458574942557291E-7,0.1260404678009768,0.8739592676132738,null,null,null,0.19856415799438068,8.852646873856429,3.0944106420923969,2.0810769624610548,2.878113919539166E-13,1.5121792211044108E-4,0.91862060169386095,8.1228180383740842E-2,null,null,null,0.22102933157802834,0.66308799473408508,0.11051466578901417,1.0982833597039278E-2,1.2,-17.192228175907097,-6.5773909683671103,-0.89948417031705397,-5.8508429155780223E-2,null,null,null,-0.70209459610867064,8.852646873856429,1.2,-12.540810830520778,-3.8203720006804476,-3.686358033004869E-2,-1.0902862168684324,null,null,null,-6.2317653473757737,-3.1158826736878869,-1.9592729120332253,1.2,-0.12604099697247539,3.0944106420923969,-0.91892303753894522,-2.3369120052659147]
[null,null,null,null,null,null,null,null,null,null,null,null,null,null,1.4,2.8139534563738851,2.3810539237437955E-17,6.1897792290047827E-7,0.18604530567026856,0.81395407535180841,null,null,null,0.13471825715196345,9.2745251997257583,3.3052786795679925,2.0513382707540981,7.8448918912047788E-13,2.5363793680209762E-4,0.94815445336994453,5.1591908692468998E-2,null,null,null,0.23609133425485659,0.70827400276456987,0.1180456671274283,7.1242144586484172E-3,1.4,-16.623123150408691,-6.208284648071003,-0.73037655522324396,-8.9399519264267049E-2,null,null,null,-0.87056790818603991,9.2745251997257583,1.4,-12.105334666651197,-3.5957625091292118,-2.312076109715553E-2,-1.2874100699538822,null,null,null,-6.111269325961147,-3.0556346629805735,-2.1472491141854091,1.4,-0.18604654362611495,3.3052786795679925,-0.94866172924590186,-2.2917259972354302]
[null,null,null,null,null,null,null,null,null,null,null,null,null,null,1.5999999999999999,2.7340725323978314,8.5488782587888467E-17,1.4022164600985738E-6,0.26592466316924818,0.7340739346142916,null,null,null,9.647580921706285E-2,9.5472193221212365,3.5159445293883027,2.0319796658593394,2.1112847262447337E-12,4.2025046708891496E-4,0.96717983320014889,3.2399916330650855E-2,null,null,null,0.25113889495630731,0.75341668486892199,0.12556944747815366,4.558876574343446E-3,1.5999999999999999,-16.067986842855802,-5.8531470457204069,-0.57523765807494465,-0.1342593273182647,null,null,null,-1.0155749951149011,9.5472193221212365,1.5999999999999999,-11.675377607370903,-3.3764699358209342,-1.4492673760896163E-2,-1.4894464685896409,null,null,null,-5.9908888403495411,-2.9954444201747705,-2.3411270090698828,1.5999999999999999,-0.26592746760216857,3.5159445293883027,-0.96802033414066058,-2.2465833151310779]
[null,null,null,null,null,null,null,null,null,null,null,null,null,null,1.7999999999999998,2.6352619881655723,2.9452643612770548E-16,3.0481070163458119E-6,0.36473191562039453,0.63526503627258879,null,null,null,7.3368250782854305E-2,9.7213898246991448,3.7264837975794283,2.0195081270624855,5.6357236557403817E-12,6.9083100428200199E-4,0.97911021091204298,2.0198958078039158E-2,null,null,null,0.26617741411281631,0.79853224233844888,0.13308870705640816,2.9142630421140946E-3,1.7999999999999998,-15.530775170977027,-5.5159340790439293,-0.43802339660076417,-0.19704377104638138,null,null,null,-1.1344844903939,9.7213898246991448,1.7999999999999998,-11.248977484182154,-3.1606077177945071,-9.1683608967905537E-3,-1.6946600608878566,null,null,null,-5.8705806870974691,-2.9352903435487345,-2.535454836656073,1.7999999999999998,-0.36473801183442767,3.7264837975794283,-0.9804918729375145,-2.2014677576615513]
[null,null,null,null,null,null,null,null,null,null,null,null,null,null,1.9999999999999998,2.5235635632819284,9.6637119913681631E-16,6.3102985440370833E-6,0.47642381612098039,0.52356987358047458,null,null,null,5.8180338206695402E-2,9.8327682426315732,3.9369472311575628,2.0114032510373887,1.4964778899630456E-11,1.1298713639788921E-3,0.98633700618975939,1.2533122431297014E-2,null,null,null,0.2812105165112545,0.84363154953376351,0.14060525825562725,1.8986855477912637E-3,1.9999999999999998,-15.014758815849069,-5.1999164291182689,-0.32200445187740029,-0.28102353152531434,null,null,null,-1.2352157616706074,9.8327682426315732,1.9999999999999998,-10.824859614883826,-2.9469519195364602,-5.9746336790264774E-3,-1.9019284047103753,null,null,null,-5.750315867909964,-2.875157933954982,-2.721529336045116,1.9999999999999998,-0.47643643671807157,3.9369472311575628,-0.98859674896261129,-2.1563684504662364]
[null,null,null,null,null,null,null,null,null,null,null,null,null,null,2.1999999999999997,2.4094531194103186,3.0087538662138324E-15,1.2396314606042857E-5,0.59052208796046002,0.40946551572493084,null,null,null,4.6429632781777051E-2,9.9056407503667288,4.1473695514894615,2.0059104123474425,3.9600702191576803E-11,1.8417864080074522E-3,0.99040601471774037,7.752198834651565E-3,null,null,null,0.29624068224924727,0.8887220467477418,0.14812034112462363,1.3103642106018175E-3,2.1999999999999997,-14.521519325895209,-4.9066756443667074,-0.22876237232813557,-0.38778015717834674,null,null,null,-1.3331961200615821,9.9056407503667288,2.1999999999999997,-10.402229768832971,-2.7347430315458201,-4.1867037485998513E-3,-2.1105614328401625,null,null,null,-5.6300745420060219,-2.8150372710030109,-2.8825893151438562,2.1999999999999997,-0.59054688058968141,4.1473695514894615,-0.9940895876525575,-2.1112779532522583]
[null,null,null,null,null,null,null,null,null,null,null,null,null,null,2.4,2.3043191633466358,8.9029033321061858E-15,2.3143955528845022E-5,0.69563454874227915,0.30434230730218298,null,null,null,3.6107748192569761E-2,9.956512633652892,4.3577764259656462,2.0017889345924105,1.0454699217274665E-10,2.995304955406816E-3,0.99222045518313517,4.784239756911053E-3,null,null,null,0.31126974471183189,0.93380923413549566,0.15563487235591594,1.0245502868026332E-3,2.4,-14.050377379605333,-4.6355324032791252,-0.15761783644285099,-0.51663432649535923,null,null,null,-1.4423902567967499,9.956512633652892,2.4,-9.9806238424991154,-2.5235426175164606,-3.3918020237361079E-3,-2.3201720434197943,null,null,null,-5.5098420423053449,-2.7549210211526725,-2.9894473669986659,2.4,-0.69568083665336422,4.3577764259656462,-0.99821106540758953,-2.0661907658645045]
[null,null,null,null,null,null,null,null,null,null,null,null,null,null,2.6,2.2162788253141601,2.5192211706521684E-14,4.1321133430407849E-5,0.78363853241890358,0.21632014644764086,null,null,null,2.6924409176750812E-2,9.9971799951163121,4.568190022913047,1.9980847429450062,2.7550259559188558E-10,4.8622983125186214E-3,0.99219065960344843,2.9470418085303209E-3,null,null,null,0.32629928735093194,0.97889786205279583,0.16314964367546597,9.7829283675257149E-4,2.6,-13.59864566465169,-4.3837993935277799,-0.10588353189380291,-0.66489872714860843,null,null,null,-1.5698436547713912,9.9971799951163121,2.6,-9.559812414658996,-2.3131434244085316,-3.4048436479981771E-3,-2.530597319776247,null,null,null,-5.3896057011925445,-2.6948028505962722,-3.0095116427801258,2.6,-0.78372117468583991,4.568190022913047,-1.0019152570549938,-2.0211021379472043]
[null,null,null,null,null,null,null,null,null,null,null,null,null,null,2.8000000000000003,2.1482551205737859,6.8768169314948149E-14,7.1169414245471254E-5,0.85160254059751683,0.14832628998816885,null,null,null,1.9223634885413371E-2,10.037190483126324,4.7786339196049799,1.9939330103462396,7.2475168089862849E-10,7.8788211123773152E-3,0.99030934525475101,1.811832908120057E-3,null,null,null,0.34133099425749858,1.0239929827724956,0.17066549712874929,1.160495343663313E-3,2.8000000000000003,-13.162527322303205,-4.1476797563815948,-6.9762599949914753E-2,-0.82877650040701756,null,null,null,-1.7161533802537337,10.037190483126324,2.8000000000000003,-9.1397515976934134,-2.1035251417235115,-4.2290952435405432E-3,-2.7418641056523523,null,null,null,-5.2693520459400114,-2.6346760229700057,-2.9353375942898112,2.8000000000000003,-0.85174487942621413,4.7786339196049799,-1.0060669896537604,-1.9760070172275044]
[null,null,null,null,null,null,null,null,null,null,null,null,null,null,3.0000000000000004,2.0988834015730835,1.8273278510425108E-13,1.1932251590498218E-4,0.90087795339455845,9.9002724089353858E-2,null,null,null,1.3232219522617399E-2,10.085949620406609,4.989138153184598,1.9883721175668378,1.9026972515378305E-9,1.2739062430535441E-2,0.98614975186399989,1.1111838027675187E-3,null,null,null,0.35636701094175699,1.069101032825271,0.17818350547087849,1.6092225748985814E-3,3.0000000000000004,-12.738101059616852,-3.9232521988975373,-4.5333747668154678E-2,-1.0043463533275547,null,null,null,-1.8783551422548281,10.085949620406609,3.0000000000000004,-8.7205738519020031,-1.8948502667097291,-6.0570910073858035E-3,-2.9541949721938252,null,null,null,-5.1490639124659445,-2.5745319562329723,-2.7933657992443965,3.0000000000000004,-0.90111659842691649,4.989138153184598,-1.0116278824331622,-1.930898967174729]
[null,null,null,null,null,null,null,null,null,null,null,null,null,null,3.2000000000000006,2.0646343675537921,4.7637572914094328E-13,1.9627073771060302E-4,0.93497309096935788,6.4830638292455223E-2,null,null,null,8.8644007327202679E-3,10.154803957266267,5.1997450596983432,1.9801443292447669,4.9811366491674657E-9,2.0534745496303703E-2,0.97878616481921565,6.7908470334399887E-4,null,null,null,0.37141036140702449,1.1142310842210734,0.18570518070351225,2.4155646442618256E-3,3.2000000000000006,-12.321970600675307,-3.7071204451582895,-2.9200699131204124E-2,-1.1882120099929012,null,null,null,-2.0523373321388125,10.154803957266267,3.2000000000000006,-8.3026177925599605,-1.6874997504147367,-9.3121177594447258E-3,-3.1680555419929353,null,null,null,-5.0287171087438036,-2.5143585543719018,-2.6169643933199338,3.2000000000000006,-0.93536563244620785,5.1997450596983432,-1.0198556707552331,-1.8857689157789266]
[null,null,null,null,null,null,null,null,null,null,null,null,null,null,3.4000000000000008,2.0415844445338887,1.2257883308933319E-12,3.1865549427751566E-4,0.95777824447387894,4.1903100030617799E-2,null,null,null,5.8347364626916698E-3,10.259427917480934,5.4105160650546065,1.9674641880235857,1.2985144523064406E-8,3.2948576097043866E-2,0.96663862082689322,4.1279009091847344E-4,null,null,null,0.38646543321818616,1.1593962996545584,0.19323271660909308,3.730481275210341E-3,3.4000000000000008,-11.911507401845244,-3.4966559515305233,-1.8734910705734902E-2,-1.3777449267697293,null,null,null,-2.2339642921843161,10.259427917480934,3.4000000000000008,-7.8865021549085945,-1.4821537535905658,-1.4735761762469135E-2,-3.3842488268231552,null,null,null,-4.9082765342545107,-2.4541382671272554,-2.4282194152016459,3.4000000000000008,-0.95841555546611135,5.4105160650546065,-1.0325358119764143,-1.8406037003454416]
[null,null,null,null,null,null,null,null,null,null,null,null,null,null,3.600000000000001,2.0263363920200486,3.1268114125243648E-12,5.1287037872579206E-4,0.9726378672131194,2.68492624050281E-2,null,null,null,3.8103571939137972E-3,10.422738817578647,5.6215382068211683,1.9477601665946145,3.3627709429357631E-8,5.2488602221647786E-2,0.9472625280789615,2.4883607168127967E-4,null,null,null,0.40153844334436917,1.2046153300331075,0.20076922167218458,5.7645414247467783E-3,3.600000000000001,-11.504823829004481,-3.2899710838920595,-1.2048748269568303E-2,-1.5710574695358599,null,null,null,-2.4190186495937334,10.422738817578647,3.600000000000001,-7.4732543318187545,-1.2799267061123663,-2.3529489895909337E-2,-3.604063330568235,null,null,null,-4.7876924532450467,-2.3938462266225233,-2.2392207387887497,3.600000000000001,-0.97366360797995144,5.6215382068211683,-1.0522398334053855,-1.7953846699668925]
[null,null,null,null,null,null,null,null,null,null,null,null,null,null,3.8000000000000012,2.0162843636216508,7.9303947451187688E-12,8.2073080375396994E-4,0.98207417474705005,1.7105094441265574E-2,null,null,null,2.500184670526769E-3,10.678157336951699,5.8329258111339772,1.9174622352028072,8.6188665796704877E-8,8.2685674803135906E-2,0.91716615662492407,1.480823832743924E-4,null,null,null,0.41663755793814122,1.2499126738144237,0.20831877896907061,8.7567174656308384E-3,3.8000000000000012,-11.100633328766268,-3.0857792888561431,-7.8556584359490544E-3,-1.7668630849045379,null,null,null,-2.602011066457655,10.678157336951699,3.8000000000000012,-7.064504106314244,-1.0825627163997427,-3.7551735975172057E-2,-3.8294718124393841,null,null,null,-4.6668995364948707,-2.3334497682474353,-2.0576453412636426,3.8000000000000012,-0.98371563637834925,5.8329258111339772,-1.0825377647971928,-1.7500873261855763]
[null,null,null,null,null,null,null,null,null,null,null,null,null,null,4.0000000000000009,2.0095474997643561,2.0037116831642475E-11,1.308401877894884E-3,0.98783569641974256,1.0855901682325392E-2,null,null,null,1.6845850296913706E-3,11.071775054733735,6.0448065155412518,1.8720535205379167,2.1738056093123842E-7,0.12803246819676922,0.87188089092686205,8.6423495807762653E-5,null,null,null,0.43177189396723226,1.2953156819016967,0.21588594698361613,1.2868405413269054E-2,4.0000000000000009,-10.698095509744979,-2.8832401750371495,-5.3152498192523788E-3,-1.9643213814901377,null,null,null,-2.7734891073952173,11.071775054733735,4.0000000000000009,-6.6627361601653874,-0.89267410294491334,-5.9542455214370411E-2,-4.0633418643726102,null,null,null,-4.5458248482621419,-2.272912424131071,-1.8904630263889404,4.0000000000000009,-0.99045250023564391,6.0448065155412518,-1.1279464794620833,-1.7046843180983033]
[null,null,null,null,null,null,null,null,null,null,null,null,null,null,4.2000000000000011,2.0047914627721255,5.0494615723314412E-11,2.0804199022272426E-3,0.99104769727193598,6.8718827753421578E-3,null,null,null,1.2139179234339427E-3,11.659035268530715,6.2572748607294768,1.8068252037984842,5.3509044692837525E-7,0.19322275279112436,0.80672768534792638,4.9026770502365288E-5,null,null,null,0.44694820433781979,1.3408446130134593,0.22347410216890989,1.7957060336547325E-2,4.2000000000000011,-10.296688267467989,-2.6818316379624569,-3.9054179468567215E-3,-2.1629102548200394,null,null,null,-2.9157917992722995,11.659035268530715,4.2000000000000011,-6.2715322004083109,-0.71393711285843497,-9.3272434798490594E-2,-4.3095388136273289,null,null,null,-4.4244143652974417,-2.2122071826487208,-1.7457534560370065,4.2000000000000011,-0.9952085372278745,6.2572748607294768,-1.1931747962015158,-1.6591553869865407]
[null,null,null,null,null,null,null,null,null,null,null,null,null,null,4.4000000000000012,2.0010399932665792,1.2700428343322344E-10,3.3015987909822278E-3,0.99235680877044297,4.3415923115704639E-3,null,null,null,9.9712047944265701E-4,12.487507292826194,6.4703073210120445,1.7188523200449657,1.2716666552514027E-6,0.28117188404753601,0.71880009685999691,2.6747425811939599E-5,null,null,null,0.46216480864371745,1.3864944259311525,0.23108240432185873,2.3275731430977956E-2,4.4000000000000012,-9.8961175637184358,-2.4812596394152018,-3.3321246018991097E-3,-2.3623356666773789,null,null,null,-3.0012329337855799,12.487507292826194,4.4000000000000012,-5.8955885481076091,-0.55102454167059978,-0.14339094472352185,-4.5726884046652261,null,null,null,-4.3026815308502604,-2.1513407654251302,-1.6330860899447812,4.4000000000000012,-0.99896000673342078,6.4703073210120445,-1.2811476799550343,-1.6135055740688475]
[null,null,null,null,null,null,null,null,null,null,null,null,null,null,4.6000000000000014,1.9975074971294191,3.1891546092044762E-10,5.2309612459720363E-3,0.99203057942189021,2.7384590132222548E-3,null,null,null,9.9080638235894865E-4,13.560292513284367,6.6836852438660559,1.6100108738685937,2.8829748737135363E-6,0.38999724741704389,0.60998598237269785,1.388723538458785E-5,null,null,null,0.4774060888475754,1.4322182665427263,0.2387030444237877,2.7393766580614137E-2,4.6000000000000014,-9.4962629466925925,-2.2814037275916559,-3.4749179806502642E-3,-2.5624771652584277,null,null,null,-3.0039917566003416,13.560292513284367,4.6000000000000014,-5.5401232757198571,-0.40893581073063834,-0.21467875523135005,-4.8573527566208448,null,null,null,-4.1807512892193968,-2.0903756446096984,-1.5623381345120178,4.6000000000000014,-1.0024925028705809,6.6836852438660559,-1.3899891261314063,-1.5677817334572737]
[null,null,null,null,null,null,null,null,null,null,null,null,null,null,4.8000000000000016,1.9934507534080974,7.9944140687684545E-10,8.2735627860654592E-3,0.99000211862144705,1.7243177930459784E-3,null,null,null,1.192811447342945E-3,14.799194350780454,6.8970304591995308,1.4890155643638556,6.1734437939392155E-6,0.5109789006254688,0.48900811405382505,6.8118769122781682E-6,null,null,null,0.49264503279996646,1.4779350983998996,0.24632251639998323,2.8772206120364838E-2,4.8000000000000016,-9.0971544660595107,-2.0822939521608701,-4.3638477521617302E-3,-2.7633648002322362,null,null,null,-2.9234092753952639,14.799194350780454,4.8000000000000016,-5.2094387754658795,-0.29159514461566094,-0.31068192325537369,-5.166699758783869,null,null,null,-4.0588397376002678,-2.0294198688001339,-1.5410168605405417,4.8000000000000016,-1.0065492465919026,6.8970304591995308,-1.5109844356361444,-1.5220649016001004]
[null,null,null,null,null,null,null,null,null,null,null,null,null,null,5.0000000000000018,1.9880255797749966,1.9997016666730045E-9,1.3057833808568009E-2,0.98585874660876238,1.0834175829679349E-3,null,null,null,1.6410383548674898E-3,16.054576211899985,7.1099804688999608,1.3695062035462746,1.2437709095454271E-5,0.63047207335090227,0.36951233662463473,3.1523153676615626E-6,null,null,null,0.50785574777856868,1.5235672433357057,0.25392787388928434,2.6826194312973339E-2,5.0000000000000018,-8.6989784739756875,-1.8841166652793448,-6.1852660729337268E-3,-2.9651849237553054,null,null,null,-2.7848632390709405,16.054576211899985,5.0000000000000018,-4.9052278484869554,-0.20033284870124937,-0.4323682584054751,-5.5013347249984834,null,null,null,-3.9371540177714506,-1.9685770088857253,-1.5714307604758215,5.0000000000000018,-1.0119744202250034,7.1099804688999608,-1.6304937964537254,-1.4764327566642943]
[null,null,null,null,null,null,null,null,null,null,null,null,null,null,5.200000000000002,1.9801321044788629,4.986930010001384E-9,2.0546563817161297E-2,0.97877475292602456,6.78678269884173E-4,null,null,null,2.4168116769759142E-3,17.173922529036645,7.322349098093679,1.2643611633409697,2.3663593383911099E-5,0.73559289260566874,0.26438206066754083,1.3831334064400469E-6,null,null,null,0.52302493557811991,1.5690748067343598,0.26151246778905995,2.2396361255394993E-2,5.200000000000002,-8.3021129787936712,-1.6872498752996254,-9.3171812955116871E-3,-3.1683155441801807,null,null,null,-2.6167402485529192,17.173922529036645,5.200000000000002,-4.6258893577004523,-0.13336161223639886,-0.57776427626227644,-5.8590979971769368,null,null,null,-3.8158005153750407,-1.9079002576875204,-1.6498118549779257,5.200000000000002,-1.0198678955211371,7.322349098093679,-1.7356388366590303,-1.4309251932656402]
[null,null,null,null,null,null,null,null,null,null,null,null,null,null,5.4000000000000021,1.9682378312133983,1.2380914472153525E-8,3.2185380797812732E-2,0.96739137004823306,4.2323677303982585E-4,null,null,null,3.6498244390078885E-3,18.068469061108772,7.5341386806955644,1.1807491532825616,4.2914539616965067E-5,0.81916559842814651,0.18079090624229457,5.8078994195864928E-7,null,null,null,0.53815276290682601,1.6144582887204781,0.269076381453413,1.7059439539753012E-2,5.4000000000000021,-7.9071960850879517,-1.4923316867962035,-1.4397697994386931E-2,-3.3733947660813528,null,null,null,-2.4377122433103775,18.068469061108772,5.4000000000000021,-4.3673672677147284,-8.6627733729235365E-2,-0.74281860923367315,-6.2359405416268938,null,null,null,-3.6947778967453919,-1.847388948372696,-1.7680237947358548,5.4000000000000021,-1.0317621687866017,7.5341386806955644,-1.8192508467174384,-1.3855417112795219]
[null,null,null,null,null,null,null,null,null,null,null,null,null,null,5.6000000000000023,1.9501865503709845,3.0529500815533627E-8,5.0075538879177768E-2,0.94966228028215738,2.6215030916399611E-4,null,null,null,5.5171228684680121E-3,18.725484058086295,7.7454546772478645,1.1193801890176205,7.5034898705262702E-5,0.88046997708605457,0.11945475211415434,2.3590108578446867E-7,null,null,null,0.55324676266056172,1.6597402879816854,0.27662338133028086,1.2122486638642497E-2,5.6000000000000023,-7.5152316429056443,-1.3003659498161928,-2.2430666216673587E-2,-3.581426439505937,null,null,null,-2.2582727239015274,18.725484058086295,5.6000000000000023,-4.1247099959105986,-5.5285090420070945E-2,-0.92279059441947398,-6.6272271553076596,null,null,null,-3.5740258987155062,-1.7870129493577531,-1.9163958790846263,5.6000000000000023,-1.0498134496290155,7.7454546772478645,-1.8806198109823795,-1.3402597120183146]
[null,null,null,null,null,null,null,null,null,null,null,null,null,null,5.8000000000000025,1.9230472862588528,7.4511488799997335E-8,7.7113278792795698E-2,0.92272593262108915,1.6071407462632645E-4,null,null,null,8.2195093332894965E-3,19.179874857945833,7.9564249462523851,1.0769000771551727,1.278343226303804E-4,0.92284434778393365,7.7027724309069193E-2,9.3584366915390495E-8,null,null,null,0.56831606758945608,1.7049482027683684,0.28415803379472804,8.2048431037867638E-3,5.8000000000000025,-7.1277306138147569,-1.1128636259276024,-3.492704753038018E-2,-3.7939215260219403,null,null,null,-2.0851406077953643,19.179874857945833,5.8000000000000025,-3.8933273199405316,-3.4871317635425239E-2,-1.1133457248202503,-7.0287511888938576,null,null,null,-3.4534714592843514,-1.7267357296421757,-2.0859162149950841,5.8000000000000025,-1.0769527137411472,7.9564249462523851,-1.9230999228448273,-1.2950517972316316]
[null,null,null,null,null,null,null,null,null,null,null,null,null,null,6.0000000000000027,1.8831481730973172,1.7909717429815086E-7,0.11694850169626846,0.88295428621862293,9.7032987934303567E-5,null,null,null,1.1906485329321799E-2,19.48181740444852,8.1671594790759396,1.048643652703463,2.1399388681592814E-4,0.95092839606164814,4.8857573512793163E-2,3.6538742831419421E-8,null,null,null,0.58336853421971002,1.7501056026591297,0.29168426710985501,5.3815843537653365E-3,6.0000000000000027,-6.7468675867427965,-0.93199930405793974,-5.4061430863014778E-2,-4.0130546145568724,null,null,null,-1.9242039614601361,19.48181740444852,6.0000000000000027,-3.6695748760666884,-2.1852042292191488E-2,-1.3110596180076259,-7.4371982506118428,null,null,null,-3.3330517262423198,-1.6665258631211599,-2.2690751579147572,6.0000000000000027,-1.1168518269026828,8.1671594790759396,-1.951356347296537,-1.2498943973408703]
[null,null,null,null,null,null,null,null,null,null,null,null,null,null,6.2000000000000028,1.8265665381519172,4.2108360492353226E-7,0.17348992553675871,0.82645234752375052,5.7305855885876475E-5,null,null,null,1.6519578156927821E-2,19.677734184369911,8.377740060160809,1.0303024016706128,3.5412219194928655E-4,0.96898936806317848,3.0656495627182468E-2,1.4117689770433502E-8,null,null,null,0.59841000429720059,1.7952300128916019,0.2992050021486003,3.471633906682522E-3,6.2000000000000028,-6.3755903919321719,-0.76072081444961248,-8.27816464569847E-2,-4.2417735353531398,null,null,null,-1.7819895103405985,19.677734184369911,6.2000000000000028,-3.4508245155006079,-1.3680899514717135E-2,-1.5134676930187576,-7.8501855434115804,null,null,null,-3.2127199656223953,-1.6063599828111976,-2.4594501560701336,6.2000000000000028,-1.1734334618480828,8.377740060160809,-1.9696975983293872,-1.2047699871083981]
[null,null,null,null,null,null,null,null,null,null,null,null,null,null,6.400000000000003,1.7503941897957942,9.6029028176582784E-7,0.24963671677554203,0.75032949578227637,3.2827151899820646E-5,null,null,null,2.157319282127345E-2,19.803712518478278,8.5882232426729104,1.0185206642117406,5.8167901716658086E-4,0.98031598317199287,1.9102332392773921E-2,5.4180666201952406E-9,null,null,null,0.61344451733377936,1.840333552001338,0.30672225866688968,2.2382327335124085E-3,6.400000000000003,-6.0175585083608913,-0.60268763608062947,-0.12474717329029877,-4.4837377673887513,null,null,null,-1.6660747885651883,19.803712518478278,6.400000000000003,-3.2352956567663207,-8.6338606268253452E-3,-1.7189024739772611,-8.2661021442164806,null,null,null,-3.0924438613297651,-1.5462219306648826,-2.6500776004342632,6.400000000000003,-1.2496058102042058,8.5882232426729104,-1.9814793357882594,-1.159666447998662]
[null,null,null,null,null,null,null,null,null,null,null,null,null,null,6.6000000000000032,1.6547717349262392,2.1048340367088852E-6,0.34524212916643437,0.65473769223878209,1.8073760746896387E-5,null,null,null,2.603014702946637E-2,19.885540132236201,8.7986468997393832,1.010898622812358,9.5092422590682246E-4,0.98719953080614053,1.184954289764013E-2,2.0703124006842728E-9,null,null,null,0.62847477855281308,1.8854243356584395,0.31423738927640654,1.4787070997504916E-3,6.6000000000000032,-5.6767453905831395,-0.46187322350517535,-0.18393146591714199,-4.7429207652178906,null,null,null,-1.5845131206156502,19.885540132236201,6.6000000000000032,-3.0218345248522489,-5.5950234988868868E-3,-1.9262859316354564,-8.6839078966608092,null,null,null,-2.9722017715774953,-1.4861008857887477,-2.830099519782094,6.6000000000000032,-1.3452282650737608,8.7986468997393832,-1.989101377187642,-1.1145756643415605]
[null,null,null,null,null,null,null,null,null,null,null,null,null,null,6.8000000000000034,1.5447548836662093,4.3988588405883458E-6,0.45524580652917329,0.54474030669892259,9.4879130636430419E-6,null,null,null,2.8555746307684936E-2,19.941073826339561,9.0090364657241615,1.0057790851587252,1.549734890864829E-3,0.99112144584836681,7.3288184719469893E-3,7.8882140107183893E-10,null,null,null,0.64350260469458298,1.9305078140837488,0.32175130234729149,1.0486342277095317E-3,6.8000000000000034,-5.3566252953574089,-0.34175183348174154,-0.26380878109600531,-5.0227967855990521,null,null,null,-1.544296487192647,19.941073826339561,6.8000000000000034,-2.8097243988671057,-3.8731014388883817E-3,-2.1349522135006027,-9.1029623824510981,null,null,null,-2.8519791624433362,-1.4259895812216681,-2.9793566824538216,6.8000000000000034,-1.4552451163337907,9.0090364657241615,-1.9942209148412748,-1.0694921859162512]
[null,null,null,null,null,null,null,null,null,null,null,null,null,null,7.0000000000000036,1.4301924557861194,8.7259469511914366E-6,0.56979481994736014,0.43019172647830684,4.7276273818858842E-6,null,null,null,2.8225149844845403E-2,19.982924718351569,9.2194099000282304,1.0020031935470231,2.5201950738495313E-3,0.99295641660521861,4.5233880209913681E-3,2.9994051250968666E-10,null,null,null,0.65852927857344501,1.9755878357203349,0.3292646392867225,8.5963164607495202E-4,7.0000000000000036,-5.0591546784839867,-0.24427992181061692,-0.36633557462717792,-5.3253222843325219,null,null,null,-1.5493537132024715,19.982924718351569,7.0000000000000036,-2.5985490185864126,-3.0697935070667956E-3,-2.3445209779176519,-9.5229032192170191,null,null,null,-2.7317657714124399,-1.36588288570622,-3.0656677577472404,7.0000000000000036,-1.5698075442138806,9.2194099000282304,-1.9979968064529769,-1.0244121642796651]
[null,null,null,null,null,null,null,null,null,null,null,null,null,null,7.2000000000000037,1.3226446007740214,1.6439591500085179E-5,0.6773247573299459,0.32265656579158708,2.2372869670326764E-6,null,null,null,2.5166049601100606E-2,20.020832466252614,9.4297815209616029,0.99869571970784365,4.0914563177732325E-3,0.993121367770468,2.7871757979005991E-3,1.138581248088399E-10,null,null,null,0.67355582292582883,2.0206674687774862,0.33677791146291441,8.7154513970799164E-4,7.2000000000000037,-4.7840780059809118,-0.16920195450983874,-0.49125631252869695,-5.6502417274363381,null,null,null,-1.5991745986525807,20.020832466252614,7.2000000000000037,-2.3881066205113122,-2.9976544218808885E-3,-2.554819097822381,-9.9435715981116637,null,null,null,-2.6115534165933694,-1.3057767082966847,-3.0596903061435565,7.2000000000000037,-1.6773553992259786,9.4297815209616029,-2.0013042802921563,-0.97933253122251385]
[null,null,null,null,null,null,null,null,null,null,null,null,null,null,7.4000000000000039,1.2310708889305968,2.9576551439537302E-5,0.76887096902949703,0.23109844335609106,1.0110629725349097E-6,null,null,null,2.0463873874287952E-2,20.063731157279108,9.6401651822701666,0.99508288805634781,6.6316159806792232E-3,0.9916538800254413,1.7145039507321528E-3,4.3147386360084171E-11,null,null,null,0.68858322730501187,2.0657496819150358,0.34429161365250593,1.0876454539105217E-3,7.4000000000000039,-4.5290231441293436,-0.11414579786056804,-0.63619886108172352,-5.9951829811916619,null,null,null,-1.6890012149143372,20.063731157279108,7.4000000000000039,-2.1783665277619018,-3.6398609596274174E-3,-2.7658436036472844,-10.364978403223724,null,null,null,-2.491334181559905,-1.2456670907799525,-2.9634934653100613,7.4000000000000039,-1.7689291110694032,9.6401651822701666,-2.0049171119436524,-0.93425031808496417]
[null,null,null,null,null,null,null,null,null,null,null,null,null,null,7.6000000000000041,1.1593551641220443,5.1245283076373541E-5,0.84054278534411397,0.15940552934049843,4.4003231113534503E-7,null,null,null,1.5436096985723404E-2,20.121755062427837,9.8505773086917063,0.99032434643730838,1.0728147538950033E-2,0.98821935850110809,1.0524939436255651E-3,1.6316367645812227E-11,null,null,null,0.7036126649065505,2.1108379947196516,0.35180633245327525,1.5558154696508929E-3,7.6000000000000041,-4.2903183278535764,-7.5439686787097823E-2,-0.79749145521055054,-6.3564742805227858,null,null,null,-1.8114507740119825,20.121755062427837,7.6000000000000041,-1.969462512116207,-5.1466095297824114E-3,-2.9777611164332889,-10.787306680225578,null,null,null,-2.371098680747596,-1.185549340373798,-2.808023735354801,7.6000000000000041,-1.8406448358779557,9.8505773086917063,-2.0096756535626916,-0.88916200528034839]
[null,null,null,null,null,null,null,null,null,null,null,null,null,null,7.8000000000000043,1.106775371172936,8.6292078788865792E-5,0.8930522307931541,0.10686129100438926,1.8612366781933033E-7,null,null,null,1.1002284535478643E-2,20.208536063728388,10.061040246754805,0.98333543685100366,1.730878520362935E-2,0.98204699274788931,6.4422204232995699E-4,6.1514361314731565E-12,null,null,null,0.71864573191105752,2.1559371957331726,0.35932286595552876,2.3763685402740731E-3,7.8000000000000043,-4.0640027581893738,-4.9122822325192696E-2,-0.97117329595094248,-6.7301548264654754,null,null,null,-1.9585044483209444,20.208536063728388,7.8000000000000043,-1.7617220060515231,-7.8676789935534872E-3,-3.1909437614255154,-11.21095090074626,null,null,null,-2.2508341447115399,-1.1254170723557699,-2.6240692173920874,7.8000000000000043,-1.893224628827064,10.061040246754805,-2.0166645631489963,-0.84406280426682745]
[null,null,null,null,null,null,null,null,null,null,null,null,null,null,8.0000000000000036,1.0700471801528715,1.4237116091243458E-4,0.92966815466051922,7.0189397043352877E-2,7.7135215522781146E-8,null,null,null,7.5354301924875139E-3,20.344214436772745,10.271586190317612,0.9725791581026616,2.7813424980569434E-2,0.97179399193850791,3.9258307861417919E-4,2.308482420943144E-12,null,null,null,0.73368472787982941,2.2010541836394881,0.36684236393991471,3.715191685370729E-3,8.0000000000000036,-3.8465530709541502,-3.1671840292264788E-2,-1.1537210191203109,-7.1127012548371402,null,null,null,-2.1228782054925031,20.344214436772745,8.0000000000000036,-1.555735456388589,-1.2425709821405263E-2,-3.4060463727441528,-11.636598092555683,null,null,null,-2.1305221769613647,-1.0652610884806823,-2.4300030419813896,8.0000000000000036,-1.9299528198471285,10.271586190317612,-2.0274208418973383,-0.79894581636051187]
[null,null,null,null,null,null,null,null,null,null,null,null,null,null,8.2000000000000028,1.0452287239954827,2.3162352342425102E-4,0.95430806047963734,4.5460284474969546E-2,3.1521968791778234E-8,null,null,null,5.0297297396036458E-3,20.55962798622204,10.482261360601155,0.9558238601100314,4.4413738611536378E-2,0.95534866266775598,2.3759871984755442E-4,8.6012965539946597E-13,null,null,null,0.74873295432865394,2.2461988629859619,0.37436647716432697,5.8165597775786722E-3,8.2000000000000028,-3.6351938018908609,-2.0311276431271709E-2,-1.3423591604616143,-7.5013381013807399,null,null,null,-2.2984404699101217,20.55962798622204,8.2000000000000028,-1.3524739117602842,-1.9837971568011533E-2,-3.6241324408656705,-12.06535796705211,null,null,null,-2.0101363653707685,-1.0050681826853842,-2.2353193327187371,8.2000000000000028,-1.9547712760045173,10.482261360601155,-2.0441761398899687,-0.75380113701403806]
[null,null,null,null,null,null,null,null,null,null,null,null,null,null,8.4000000000000021,1.0287956243558241,3.7331093522827272E-4,0.97045776653520954,2.9168909768072241E-2,1.2761489946631655E-8,null,null,null,3.313200452824289E-3,20.902049214055296,10.693128606202979,0.92991090841498747,7.0231364877945623E-2,0.92962636182943836,1.4227329229914547E-4,3.1693920261516443E-13,null,null,null,0.76379490044306997,2.2913847013292101,0.38189745022153498,8.9999527839548198E-3,8.4000000000000021,-3.42790709592082,-1.3023275663527704E-2,-1.5350698648961667,-7.8940475110175878,null,null,null,-2.4797362340690454,20.902049214055296,8.4000000000000021,-1.1534614238684855,-3.1691364125910462E-2,-3.8468517138732667,-12.498943120509406,null,null,null,-1.8896407964554403,-0.94482039822772013,-2.045746524748945,8.4000000000000021,-1.9712043756441759,10.693128606202979,-2.0700890915850128,-0.70861529867078987]
[null,null,null,null,null,null,null,null,null,null,null,null,null,null,8.6000000000000014,1.0180025491195841,5.9796422975356425E-4,0.98080152755549987,1.8600503080155279E-2,5.1345912481854244E-9,null,null,null,2.1848262778641201E-3,21.442285725788679,10.904263374595613,0.890687866722077,0.10939594870769613,0.89052023586264561,8.381542954346015E-5,1.1482640976917698E-13,null,null,null,0.77887595532825815,2.3366278659847741,0.38943797766412908,1.3608282585501376E-2,8.6000000000000014,-3.2233039269818167,-8.4188119268200669E-3,-1.7304641063617552,-8.2894404576854726,null,null,null,-2.6605658648022894,21.442285725788679,8.6000000000000014,-0.96099253956496733,-5.035588133096084E-2,-4.0766496325868857,-12.939874440731593,null,null,null,-1.7689923573739348,-0.88449617868696739,-1.8661845991374406,8.6000000000000014,-1.9819974508804159,10.904263374595613,-2.109312133277923,-0.66337213401522588]
[null,null,null,null,null,null,null,null,null,null,null,null,null,null,8.8000000000000007,1.0108591621796201,9.5392390497511901E-4,0.98723299206795134,1.1813081969552013E-2,2.0575215999712446E-9,null,null,null,1.4750117581534686E-3,22.281442677194718,11.115733453073027,0.83345430369094209,0.16659389571259955,0.8333579048838996,4.8199403460318842E-5,4.0577883955737625E-14,null,null,null,0.79398096093378767,2.3819428828013627,0.39699048046689384,1.9864405427772912E-2,8.8000000000000007,-3.0204667132260674,-5.5803033733675582E-3,-1.9276243030105991,-8.6865993595366131,null,null,null,-2.8311861884793958,22.281442677194718,8.8000000000000007,-0.77833587696570172,-7.9167928154249348E-2,-4.3169303888327279,-13.391623906399989,null,null,null,-1.6481523125296986,-0.82407615626484931,-1.7019134112771221,8.8000000000000007,-1.9891408378203799,11.115733453073027,-2.1665456963090577,-0.61805711719863732]
[null,null,null,null,null,null,null,null,null,null,null,null,null,null,9,1.0059643590050169,1.5176369346641891E-3,0.99100036794789437,7.4819942952013959E-3,8.222399205739279E-10,null,null,null,1.0616998013731854E-3,23.553723619261291,11.327553158845967,0.75442460377135589,0.2456021863941559,0.75437102344034646,2.6790165483948131E-5,1.3848521930202158E-14,null,null,null,0.80911093991756911,2.4273328197527073,0.40455546995878455,2.7642617596644499E-2,9,-2.8188138634981055,-3.9261588477017819E-3,-2.1259688636872296,-9.0849426254155397,null,null,null,-2.9739790102616657,23.553723619261291,9,-0.60976382371772753,-0.12241420936087337,-4.5719950044939504,-13.85850685651581,null,null,null,-1.5271124806594472,-0.76355624032972358,-1.5584107449663964,9,-1.9940356409949831,11.327553158845967,-2.2455753962286442,-0.57266718024729268]
[null,null,null,null,null,null,null,null,null,null,null,null,null,null,9.1999999999999993,1.0023198737902235,2.4098072685543978E-3,0.99286051200062175,4.7296804028698278E-3,3.2795403675143606E-10,null,null,null,8.6836671180764188E-4,25.425947584153619,11.539624057245398,0.65338334854214952,0.34663089010190618,0.65335487125404246,1.4238644046759861E-5,4.5167469670538582E-15,null,null,null,0.82425886123181413,2.4727765836954423,0.41212943061590707,3.6354060271112647E-2,9.1999999999999993,-2.6180007410021977,-3.111741554090532E-3,-2.3251531515959147,-9.4841256185265213,null,null,null,-3.0612770144540971,25.425947584153619,9.1999999999999993,-0.46012975873777456,-0.18484966983579007,-4.8464999904237365,-14.345081367900466,null,null,null,-1.4059291101454869,-0.70296455507274347,-1.4394377581419544,9.1999999999999993,-1.9976801262097765,11.539624057245398,-2.3466166514578504,-0.52722341630455771]
[null,null,null,null,null,null,null,null,null,null,null,null,null,null,9.3999999999999986,0.99916465906032204,3.8205707480714248E-3,0.9931941995741399,2.9852295471840063E-3,1.3060473345656519E-10,null,null,null,8.5798658733276796E-4,28.122492051625159,11.751718173325493,0.53632026280259038,0.46368690915931121,0.53630591887878865,7.171961898785251E-6,1.3960500420025606E-15,null,null,null,0.83940844095182088,2.518225322855463,0.41970422047591044,4.5379988512943843E-2,9.3999999999999986,-2.4178561005100265,-2.9658062642157344E-3,-2.5250059215083365,-9.8839770936412386,null,null,null,-3.0664996486918232,28.122492051625159,9.3999999999999986,-0.33377300410619953,-0.27058565818943875,-5.1443287217626095,-14.855002842224563,null,null,null,-1.284732472385433,-0.64236623619271649,-1.3431269229396519,9.3999999999999986,-2.0008353409396777,11.751718173325493,-2.4636797371974097,-0.48177467714453703]
[null,null,null,null,null,null,null,null,null,null,null,null,null,null,9.5999999999999979,0.99583307695187606,6.0483441063189178E-3,0.99207023488742163,1.881420954323485E-3,5.1935840254388812E-11,null,null,null,1.0290521629532994E-3,32.065280988172162,11.963554366049292,0.41526219743916726,0.58474121216887731,0.41525537822307884,3.4096080435792799E-6,4.0750343744267386E-16,null,null,null,0.85453959757494946,2.5636187927248484,0.42726979878747473,5.523328548968038E-2,9.5999999999999979,-2.2183491469805219,-3.457557937007636E-3,-2.7254963783834243,-10.284466255718623,null,null,null,-2.9875432687200183,32.065280988172162,9.5999999999999979,-0.23303478762559407,-0.38168226300755415,-5.4672601478794451,-15.38976908964012,null,null,null,-1.1636832194004043,-0.58184160970020216,-1.2577909795135389,9.5999999999999979,-2.0041669230481238,11.963554366049292,-2.5847378025608325,-0.43638120727515162]
[null,null,null,null,null,null,null,null,null,null,null,null,null,null,9.7999999999999972,0.99162492993690565,9.558800759507791E-3,0.98925746856469599,1.183730655178713E-3,2.0617408715658796E-11,null,null,null,1.4158831559157431E-3,38.31748273660196,12.174908797581793,0.30387243327183067,0.69612910036199671,0.30386936600417597,1.533633827144236E-6,1.1266630909495503E-16,null,null,null,0.86963634268441381,2.6089090280532412,0.43481817134220691,6.8730051464283209E-2,9.7999999999999972,-2.0195835157446624,-4.6906319034443382E-3,-2.9267281575521573,-10.685696740089654,null,null,null,-2.848954140590628,38.31748273660196,9.7999999999999972,-0.15730919257483819,-0.51730973118313639,-5.8142406792813661,-15.948102684268379,null,null,null,-1.0429092585246895,-0.52145462926234476,-1.1628458025969262,9.7999999999999972,-2.0083750700630945,12.174908797581793,-2.6961275667281694,-0.39109097194675879]
[null,null,null,null,null,null,null,null,null,null,null,null,null,null,9.9999999999999964,0.98567105712219227,1.5071996722906525E-2,0.98418494944016033,7.4305382876725494E-4,8.1658512027948545E-12,null,null,null,2.0937939301416968E-3,49.999999998544808,12.385643935645515,0.21179059338548806,0.78821006458072074,0.21178927745307055,6.5796620871604737E-7,2.9753690426844751E-17,null,null,null,0.88468885254610818,2.6540665576383242,0.44234442627305409,9.1310450241663066E-2,9.9999999999999964,-1.8218174144781514,-6.9232358392294574E-3,-3.1289594666902389,-11.087926754430031,null,null,null,-2.6790487192959236,49.999999998544808,9.9999999999999964,-0.10335735483066054,-0.67409166720581704,-6.1817563890709053,-16.526352167824776,null,null,null,-0.92248917963113453,-0.46124458981556726,-1.0394727861778328,9.9999999999999964,-2.0143289428778077,12.385643935645515,-2.788209406614512,-0.34593344236167578]
[null,null,null,null,null,null,null,null,null,null,null,null,null,null,10.199999999999996,0.97677966190913523,2.3685202823609631E-2,0.97584993244686868,4.6486472629832487E-4,3.2233523313833998E-12,null,null,null,3.1884721452273466E-3,null,null,null,null,null,null,null,null,null,null,null,null,null,null,10.199999999999996,-1.6255123683075723,-1.061689487094657E-2,-3.3326518309242523,-11.49161782386634,null,null,null,-2.4964012109174858,null,10.199999999999996,null,null,null,null,null,null,null,null,null,null,10.199999999999996,-2.0232203380908649]
[null,null,null,null,null,null,null,null,null,null,null,null,null,null,10.399999999999995,0.96325749519364512,3.7031855791726936E-2,0.96267879322416694,2.8935098284026221E-4,1.2659196685526628E-12,null,null,null,4.8865028458402234E-3,null,null,null,null,null,null,null,null,null,null,null,null,null,null,10.399999999999995,-1.4314152564117639,-1.6518488177434561E-2,-3.5385521294330369,-11.897516827577421,null,null,null,-2.3109868825663575,null,10.399999999999995,null,null,null,null,null,null,null,null,null,null,10.399999999999995,-2.0367425048063548]
[null,null,null,null,null,null,null,null,null,null,null,null,null,null,10.599999999999994,0.94272546418019187,5.7453252095010378E-2,0.94236803163028049,1.7871627421570579E-4,4.9333881645131508E-13,null,null,null,7.438465095029591E-3,null,null,null,null,null,null,null,null,null,null,null,null,null,null,10.599999999999994,-1.2406773512080227,-2.5779288175989661E-2,-3.7478116346338881,-12.306775037980568,null,null,null,-2.1285028905812258,null,10.599999999999994,null,null,null,null,null,null,null,null,null,null,10.599999999999994,-2.0572745358198081]
[null,null,null,null,null,null,null,null,null,null,null,null,null,null,10.799999999999994,0.91200662160559731,8.8102481629514895E-2,0.91178841513556308,1.0910323473208167E-4,1.9002853164533453E-13,null,null,null,1.1136071889972565E-2,null,null,null,null,null,null,null,null,null,null,null,null,null,null,10.799999999999994,-1.0550050282770729,-4.010567044733615E-2,-3.9621367221075308,-12.721098830656508,null,null,null,-1.9532553286606473,null,10.799999999999994,null,null,null,null,null,null,null,null,null,null,10.799999999999994,-2.0879933783944029]
[null,null,null,null,null,null,null,null,null,null,null,null,null,null,10.999999999999993,0.86727011480118732,0.13279535369514844,0.86713917780858774,6.5468496191826997E-5,7.1947142680111086E-14,null,null,null,1.6234447597023374E-2,null,null,null,null,null,null,null,null,null,null,null,null,null,null,10.999999999999993,-0.87681144349309437,-6.191079086565409E-2,-4.1839405477281453,-13.142901361479419,null,null,null,-1.789550898742132,null,10.999999999999993,null,null,null,null,null,null,null,null,null,null,10.999999999999993,-2.1327298851988128]
[null,null,null,null,null,null,null,null,null,null,null,null,null,null,11.199999999999992,0.80473647084949662,0.19530186065511448,0.80465980784030089,3.8331504557983186E-5,2.6578902978136064E-14,null,null,null,2.2801366917055674E-2,null,null,null,null,null,null,null,null,null,null,null,null,null,null,11.199999999999992,-0.7092890271783906,-9.4387079753246672E-2,-4.4164155418180338,-13.575375060771604,null,null,null,-1.6420284861966383,null,11.199999999999992,null,null,null,null,null,null,null,null,null,null,11.199999999999992,-2.1952635291505036]
[null,null,null,null,null,null,null,null,null,null,null,null,null,null,11.399999999999991,0.72221881395640797,0.27780289236597144,0.72217540131165869,2.1706322360415026E-5,9.4965844381332886E-15,null,null,null,3.0553630750289672E-2,null,null,null,null,null,null,null,null,null,null,null,null,null,null,11.399999999999991,-0.55625963564298297,-0.1413563934201352,-4.6633835606872189,-14.022341784843087,null,null,null,-1.5149273665694651,null,11.399999999999991,null,null,null,null,null,null,null,null,null,null,11.399999999999991,-2.2777811860435921]
[null,null,null,null,null,null,null,null,null,null,null,null,null,null,11.599999999999991,0.62126200054383174,0.3787497809911185,0.62123843747393459,1.17815349437159E-5,3.2522435523120755E-15,null,null,null,3.8901944703044415E-2,null,null,null,null,null,null,null,null,null,null,null,null,null,null,11.599999999999991,-0.42164487987492255,-0.20674034285437121,-4.9287662153237513,-14.487723144681913,null,null,null,-1.4100195592986766,null,11.599999999999991,null,null,null,null,null,null,null,null,null,null,11.599999999999991,-2.3787379994561682]
[null,null,null,null,null,null,null,null,null,null,null,null,null,null,11.79999999999999,0.50858877596904672,0.49141730958235946,0.50857660486623535,6.0855514041288533E-6,1.0599396071240158E-15,null,null,null,4.7492454760874082E-2,null,null,null,null,null,null,null,null,null,null,null,null,null,null,11.79999999999999,-0.30854755254065785,-0.2936417207224028,-5.2156662983940798,-14.974621932954539,null,null,null,-1.323366814773985,null,11.79999999999999,null,null,null,null,null,null,null,null,null,null,11.79999999999999,-2.4914112240309532]
[null,null,null,null,null,null,null,null,null,null,null,null,null,null,11.999999999999989,0.39504011808192208,0.60496286440262215,0.39503415311283407,2.9824845434925367E-6,3.2776259342073192E-16,null,null,null,5.7179367525627023E-2,null,null,null,null,null,null,null,null,null,null,null,null,null,null,11.999999999999989,-0.21826987057582137,-0.40336274395986266,-5.5253860268338348,-15.484340366596591,null,null,null,-1.2427526071662254,null,11.999999999999989,null,null,null,null,null,null,null,null,null,null,11.999999999999989,-2.6049598819180781]
[null,null,null,null,null,null,null,null,null,null,null,null,null,null,12.199999999999989,0.29179122245083511,0.70821016753905941,0.29178844247104618,1.3899898943089273E-6,9.6381310797602333E-17,null,null,null,7.0806926153434244E-2,null,null,null,null,null,null,null,null,null,null,null,null,null,null,12.199999999999989,-0.14983687246249119,-0.53492845104882891,-5.8569504391250975,-16.015903484090149,null,null,null,-1.149916814054246,null,12.199999999999989,null,null,null,null,null,null,null,null,null,null,12.199999999999989,-2.708208777549165]
[null,null,null,null,null,null,null,null,null,null,null,null,null,null,12.399999999999988,0.20632489639774698,0.79367572374630424,0.20632365610964459,6.2014405114896231E-7,2.7131497670384811E-17,null,null,null,9.3367151729144296E-2,null,null,null,null,null,null,null,null,null,null,null,null,null,null,12.399999999999988,-0.10035625359870899,-0.68544653738734296,-6.207467230665908,-16.566418980833255,null,null,null,-1.0297992226852899,null,12.399999999999988,null,null,null,null,null,null,null,null,null,null,12.399999999999988,-2.7936751036022529]
[null,null,null,null,null,null,null,null,null,null,null,null,null,null,12.599999999999987,0.14091127091902761,0.85908899631246771,0.14091073645603708,2.6723149524552903E-7,7.3768139002173107E-18,null,null,null,0.13203373475581767,null,null,null,null,null,null,null,null,null,null,null,null,null,null,12.599999999999987,-6.5961416576819976E-2,-0.85105040556775013,-6.573069804048612,-17.132020259418255,null,null,null,-0.87930939925098861,null,12.599999999999987,null,null,null,null,null,null,null,null,null,null,12.599999999999987,-2.8590887290809723]
[null,null,null,null,null,null,null,null,null,null,null,null,null,null,12.799999999999986,9.3785956013772473E-2,0.90621415620882773,9.3785731568571895E-2,1.1222260028742242E-7,1.9546162863464389E-18,null,null,null,0.19695540486637989,null,null,null,null,null,null,null,null,null,null,null,null,null,null,12.799999999999986,-4.2768880988888119E-2,-1.0278565751821147,-6.9498746788652737,-17.708823839437212,null,null,null,-0.70562752849241495,null,12.799999999999986,null,null,null,null,null,null,null,null,null,null,12.799999999999986,-2.9062140439862274]
[null,null,null,null,null,null,null,null,null,null,null,null,null,null,12.999999999999986,6.1296415927851206E-2,0.9387036303505113,6.1296323371126379E-2,4.6278362411639003E-8,5.0857987232152105E-19,null,null,null,0.3032696874017477,null,null,null,null,null,null,null,null,null,null,null,null,null,null,12.999999999999986,-2.7471324686481727E-2,-1.2125577240820047,-7.3345745329674594,-18.293522398741693,null,null,null,-0.51816764175605601,null,12.999999999999986,null,null,null,null,null,null,null,null,null,null,12.999999999999986,-2.9387035840721487]
[null,null,null,null,null,null,null,null,null,null,null,null,null,null,13.199999999999985,3.9570526588397291E-2,0.96042949226175967,3.9570488888083184E-2,1.8850157052659E-8,1.3070619095250562E-19,null,null,null,0.47452643184760263,null,null,null,null,null,null,null,null,null,null,null,null,null,null,13.199999999999985,-1.7534398851584861E-2,-1.4026195034494042,-7.7246350175371541,-18.883581588513689,null,null,null,-0.32373749581003769,null,13.199999999999985,null,null,null,null,null,null,null,null,null,null,13.199999999999985,-2.9604294734116028]
[null,null,null,null,null,null,null,null,null,null,null,null,null,null,13.399999999999984,2.5337311671560211E-2,0.97466269594403465,2.5337296440370579E-2,7.6155948164003231E-9,3.3318467320124258E-20,null,null,null,0.74798220973199625,null,null,null,null,null,null,null,null,null,null,null,null,null,null,13.399999999999984,-1.1145583565406543E-2,-1.5962293933655221,-8.1182436126555686,-19.477188888834398,null,null,null,-0.12610791499663515,null,13.399999999999984,null,null,null,null,null,null,null,null,null,null,13.399999999999984,-2.9746626883284399]
[null,null,null,null,null,null,null,null,null,null,null,null,null,null,13.599999999999984,1.6137655257964671E-2,0.98386234780247495,1.6137649137085288E-2,3.0604396919013453E-9,8.4482160455121434E-21,null,null,null,1.1827937293584514,null,null,null,null,null,null,null,null,null,null,null,null,null,null,13.599999999999984,-7.0656137236618519E-3,-1.7921481287260734,-8.514161053218416,null,null,null,null,7.2908541413623754E-2,null,13.599999999999984,null,null,null,null,null,null,null,null,null,null,13.599999999999984,-2.9838623447420352]
[null,null,null,null,null,null,null,null,null,null,null,null,null,null,13.799999999999983,1.0243173726719646E-2,0.98975682749896277,1.0243171275354611E-2,1.2256825174619056E-9,2.1348097481124492E-21,null,null,null,1.8728718471547081,null,null,null,null,null,null,null,null,null,null,null,null,null,null,13.799999999999983,-4.4714647850776111E-3,-1.9895526849897858,-8.9115643146844246,null,null,null,null,0.27250629720940811,null,13.799999999999983,null,null,null,null,null,null,null,null,null,null,13.799999999999983,-2.9897568262732803]
[null,null,null,null,null,null,null,null,null,null,null,null,null,null,13.999999999999982,6.4875290717873058E-3,0.99351247141801713,6.4875280921782219E-3,4.8980454241557239E-10,5.3827473286212253E-22,null,null,null,2.9671939901579969,null,null,null,null,null,null,null,null,null,null,null,null,null,null,13.999999999999982,-2.8266585844067115E-3,-2.1879065839914111,-9.3099169188883462,null,null,null,null,0.47234288272642883,null,13.999999999999982,null,null,null,null,null,null,null,null,null,null,13.999999999999982,-2.9935124709282128]

{"sheet":"Evaluation","index":6,"n_rows":306,"n_cols":23,"rows_kept":306,"cut":false,"hidden":false,"merged":[]}
[null,null,"    Evaluation of Real and Simulated Titration Data by Derivatives with Interpolation",null,null,null,null,null,null,null,null,null,null,null,null,null,null,null,null,null,"Color  coding"]
["      Interpolation and smoothing by cubic splines",null,null,null,null,null,null,"Degree of smoothing  ",null,"    Fitting range (zoom)",null,null,"Fit quality of the splines to pH   ",null,null,null,"Inflection auto-finder - derivative-based",null,null,null,"         D  o     n  o  t     c  h  a  n  g  e "]
[null,null,null,null,null,null,null," (0 to 100%)",85,"Initial volume",0,null,"Fitted pH std. dev. ",8.5396420668070364E-2,null,"Detector threshold |dpH/dV| >",1,"guess value",0.38695946908090278,"F i l l   o u t ","o r  "," c h a n g e"]
[null,null,null,null,null,null,null,"Interpolated points",300,"Final volume",49.999999998544808,null,"Correlation coefficient",0.99956844021720814,null,null,"Detected inflection points",null,null,"    Interpolated spline smoothed data"]
["Volume","pH","Fitted pH","dpH/dV",null,null,null,null,null,null,null,null,null,null,"step","Volume","pH","dpH/dV","d2pH/dV2","Interp. Vol.","Fitted pH","dpH/dV","d2pH/dV2"]
[0,2.2482361616632276,2.2477912303889083,4.4394079910987393E-2,null,null,null,null,null,null,null,null,null,null,1,10.047833361532291,4.6069860909514464,1.8216420994200988,1.2228618118471162E-3,0,2.2477912303889083,4.438840152905367E-2,0]
[2.1441188422613777,2.3647922005853386,2.3653543093932039,7.6443676588939719E-2,null,null,null,null,null,null,null,null,null,null,2,30.01250000066441,9.3392150292822347,1.8869309236622829,-3.4716549636060268E-3,0.16666666666181604,2.2551998129407687,4.4577872352090181E-2,1.1356915408639271E-3]
[4.004995925060939,2.5506499922129273,2.5529887795508976,0.12440848293731632,null,null,null,null,null,null,null,null,null,null,3,null,null,null,null,0.33333333332363208,2.2626714893403927,4.514590626534639E-2,2.2713830817486708E-3]
[5.5376416989020072,2.7350617167038536,2.7241842697076466,6.785983666046537E-2,null,null,null,null,null,null,null,null,null,null,4,null,null,null,null,0.49999999998544808,2.2702693534355443,4.6092503263493213E-2,3.4070746226334148E-3]
[6.745316281740088,2.8001589143336103,2.8168921085253715,0.15152556009756529,null,null,null,null,null,null,null,null,null,null,5,null,null,null,null,0.66666666664726415,2.2780564990739869,4.7417663346530657E-2,4.5427581698915644E-3]
[7.6638402344542556,3.0210089771607134,3.0105489912522088,0.23935895754652789,null,null,null,null,null,null,null,null,null,null,6,null,null,null,null,0.83333333330908022,2.2860960201034839,4.9121386519787792E-2,5.6784577043820861E-3]
[8.3438355490216054,3.2059162355606015,3.1735117715601051,0.24585077064987898,null,null,null,null,null,null,null,null,null,null,7,null,null,null,null,0.99999999997089617,2.2944510103717999,5.1203672775271013E-2,6.8141332580552742E-3]
[8.8374652448692359,3.3224174642237614,3.3191185459523194,0.40254228756618149,null,null,null,null,null,null,null,null,null,null,8,null,null,null,null,1.1666666666327123,2.3031845637266972,5.3664522120973918E-2,7.9498327925249784E-3]
[9.1911136594717391,3.5577328532705077,3.4994963911690729,0.68128674965399272,null,null,null,null,null,null,null,null,null,null,9,null,null,null,null,1.3333333332945283,2.3123597740159409,5.650393455156745E-2,9.0855163398039455E-3]
[9.4426845156704076,3.6543097997180687,3.702783938622709,1.0343538347538883,null,null,null,null,null,null,null,null,null,null,10,null,null,null,null,1.4999999999563443,2.3220397350872939,5.9721910067051596E-2,1.0221191893477134E-2]
[9.6216144142090343,3.7902703812451346,3.9087827748667299,1.3673466497569156,null,null,null,null,null,null,null,null,null,null,11,null,null,null,null,1.6666666666181604,2.3322875407885197,6.3318448672755434E-2,1.1356891427946839E-2]
[9.7501260883291252,3.9695198921904384,4.093756388175696,1.5931835522330977,null,null,null,null,null,null,null,null,null,null,12,null,null,null,null,1.8333333332799764,2.3431662849673827,6.7293550363349885E-2,1.2492574975225806E-2]
[9.8448491291492246,4.2963445528630579,4.2476246848804697,1.7123901295921333,null,null,null,null,null,null,null,null,null,null,13,null,null,null,null,1.9999999999417923,2.3547390614716459,7.1647215138834958E-2,1.3628258522463138E-2]
[9.9183949307189323,4.4234688315192683,4.37437211645784,1.7748851492560465,null,null,null,null,null,null,null,null,null,null,14,null,null,null,null,2.1666666666036085,2.3670689312539968,7.63750338648196E-2,1.4569841334252029E-2]
[9.9807470614905469,4.3161688355486536,4.485300612834406,1.8114455126765505,null,null,null,null,null,null,null,null,null,null,15,null,null,null,null,2.3333333332654247,2.3801996475684373,8.1181752189660866E-2,1.4270760574085604E-2]
[10.040469448722433,4.3549548393368696,4.5935727403477191,1.8176462791875643,null,null,null,null,null,null,null,null,null,null,null,null,"Titrand concentration calculator",null,null,2.4999999999272404,2.3941231836829133,8.5888771766575181E-2,1.3971647839496067E-2]
[10.105798782024067,4.8580520113807184,4.7120782207504153,1.7687521014919825,null,null,null,null,null,null,null,null,null,null,null,null,"(optional and modifiable)",null,null,2.6666666665890566,2.4088229231402556,9.0496092603556164E-2,1.3672559085682229E-2]
[10.185713412647601,5.1357991946662338,4.8517876304261467,1.6437152120890819,null,null,null,null,null,null,null,null,null,null,null,null,null,null,null,2.8333333332508728,2.4242822494832952,9.5003714697939279E-2,1.337346233830425E-2]
[10.291077989677433,5.1329008521350588,5.0194538449700117,1.4393694924113245,null,null,null,null,null,null,null,null,null,null,null,null,"Volume of titrand (sample pipetted into cell)  ",20,"  mL",2.9999999999126885,2.4404845462548628,9.9411638049724527E-2,1.3074373584532046E-2]
[10.435955300636124,5.2423833602130161,5.2146492768169725,1.1641204134540271,null,null,null,null,null,null,null,null,null,null,null,null,"Concentration of titrant (in the buret)  ",0.1,"  mol/L",3.1666666665745047,2.4574131969977904,0.10371986265624737,1.2775276837154065E-2]
[10.639140704006422,5.4344364742158016,5.4251033055535851,0.84111876904719718,null,null,null,null,null,null,null,null,null,null,null,null,"  Number of mols of titrant",null,"Result (mol/L)",3.3333333332363209,2.4750515852549082,0.10792838852017235,1.2476180089734451E-2]
[10.925871347717475,5.5859265023774283,5.6263700185926995,0.54062439586068511,null,null,null,null,null,null,null,null,null,null,"step","Vol. Inflection","total","stepwise","[species]",3.4999999998981366,2.4933830945690478,0.11203721564149946,1.2177075348750692E-2]
[11.32941198447952,5.7817853807000468,5.800969957723205,0.32662601854994733,null,null,null,null,null,null,null,null,null,null,1,10.047833361532291,{"$f":"IF(P28<>\"\",P28*0.001*$R$25,\"\")","v":1.0047833361532291E-3},{"$f":"IF(P28<>\"\",Q28,\"\")","v":1.0047833361532291E-3},{"$f":"IF(P28<>\"\",R28/$R$24/0.001,\"\")","v":5.023916680766146E-2},3.6666666665599528,2.5123911084830399,0.1160463440202287,1.1877986595020122E-2]
[11.891695459780749,5.9333775681693366,5.9498505351300084,0.21842310493949785,null,null,null,null,null,null,null,null,null,null,2,30.01250000066441,{"$f":"IF(P29<>\"\",P29*0.001*$R$25,\"\")","v":3.0012500000664412E-3},{"$f":"IF(P29<>\"\",(Q29-Q28),\"\")","v":1.9964666639132123E-3},{"$f":"IF(P29<>\"\",R29/$R$24/0.001,\"\")","v":9.9823333195660613E-2},3.8333333332217689,2.5320590105397156,0.11995577365636007,1.1578889847600507E-2]
[12.661303962522652,6.1015246164126706,6.0975497546929853,0.15961767587332287,null,null,null,null,null,null,null,null,null,null,3,null,"",{"$f":"IF(P30<>\"\",(Q30-Q29),\"\")","v":""},"",3.9999999998835847,2.552370184281906,0.12376550454722904,1.1279793100222526E-2]
[13.68609245546395,6.2343706579746305,6.2373585060206231,0.12940471512893156,null,null,null,null,null,null,null,null,null,null,4,null,"","","",4.1666666665454013,2.5732575608785768,0.12653836520839193,5.1898725320476662E-3]
[14.998016964818817,6.4237087256565042,6.4272567565249483,0.16415814249331287,null,null,null,null,null,null,null,null,null,null,5,null,"","","",4.333333333207217,2.594433262584293,0.12722246958689071,-1.0789928950630634E-3]
[16.591740037256386,6.6692782825219714,6.6623664324466985,8.6695023720403011E-2,null,null,null,null,null,null,null,null,null,null,6,null,"","","",4.4999999998690328,2.6155490207556742,0.12581695317426056,-7.3478583222570601E-3]
[18.406854815839324,6.7265948707517058,6.7317303456254196,5.0545501636701823E-2,null,null,null,null,null,null,null,null,null,null,7,null,"","","",4.6666666665308494,2.6362565652605445,0.12232181596783695,-1.3616715755762013E-2]
[20.328983447689097,6.919625802232388,6.9194937491760591,0.11920556329351063,null,null,null,null,null,null,null,null,null,null,8,null,"","","",4.8333333331926651,2.6562076259667284,0.11673705796761988,-1.9885581182872744E-2]
[22.216620297695044,7.0953256149307116,7.0887918691417378,3.3962321941161451E-2,null,null,null,null,null,null,null,null,null,null,9,null,"","","",4.9999999998544808,2.6750539327420495,0.10906267917627388,-2.6154438616377694E-2]
[23.941385601938237,7.1512500737592566,7.1647414420374025,0.13597817354442276,null,null,null,null,null,null,null,null,null,null,10,null,"","","",5.1666666665162975,2.6924472154543322,9.9298679593798955E-2,-3.2423288056276874E-2]
[25.419121760933194,7.4514787286653243,7.4329580755025031,0.13503380799628742,null,null,null,null,null,null,null,null,null,null,"Results of the Example: ",null,null,null,null,5.3333333331781132,2.708039203971401,8.7445059212201484E-2,-3.8692161477035011E-2]
[26.618562547082547,7.5401593301441734,7.5596299835371328,0.15172498308877611,null,null,null,null,null,null,null,null,null,null,"[H3PO4] =  0,0501 mol/L in the 20 mL of sample",null,null,null,null,5.4999999998399289,2.7214816281610794,7.3501818042139622E-2,-4.4961018910539961E-2]
[27.550935077306349,7.7563774949247826,7.7429813680716082,0.20368142504405484,null,null,null,null,null,null,null,null,null,null,"[NaH2PO4] =  [H2PO4- titrated] - [H3PO4] = 0,1000 - 0,0501 = 0,0499 mol/L ",null,null,null,null,5.6666666665017456,2.732545491629895,6.0245811080305356E-2,-2.9735821806616828E-2]
[28.252110099128913,7.9134510497316528,7.8772984836701303,0.18924152373658837,null,null,null,null,null,null,null,null,null,null,"For this sample, half of the determined H2PO4- came from the H3PO4",null,null,null,null,5.8333333331635613,2.7419603268952932,5.3920100447483715E-2,-8.2399447270298295E-3]
[28.76675075822277,7.9963996764286227,8.0049076159001462,0.37901352359584767,null,null,null,null,null,null,null,null,null,null,null,null,null,null,null,5.999999999825377,2.7509173875702602,5.4759681287026005E-2,1.325592435897221E-2]
[29.138159849389922,8.2263819666307043,8.1929929077639194,0.69928697951592,null,null,null,null,null,null,null,null,null,null,null,"How to change the axis of a curve",null,null,null,6.1666666664871936,2.7606108889005831,6.2764553601596745E-2,3.4751793444932615E-2]
[29.403460801404435,8.4238610949150825,8.4135759117230755,1.0529584187757943,null,null,null,null,null,null,null,null,null,null,null,"How to copy/paste a curve",null,null,null,6.3333333331490094,2.7722350461320491,7.7934717393860486E-2,5.6247686511731169E-2]
[29.592312754539307,8.4704538960139431,8.6351335225611656,1.3952687871227101,null,null,null,null,null,null,null,null,null,null,null,"Data ID on curves",null,null,null,6.4999999998108251,2.7869840745104462,0.10027017265848816,7.7743555597712385E-2]
[29.727469007775653,8.8064331886117166,8.8341611651758605,1.6289122911840936,null,null,null,null,null,null,null,null,null,null,null,null,null,null,null,6.6666666664726417,2.8060521892815613,0.12977091939814428,9.9239424683735242E-2]
[29.826065547240432,9.0470594645874822,8.9982103608112141,1.7625324468647061,null,null,null,null,null,null,null,null,null,null,null,null,null,null,null,6.8333333331344575,2.8305753583805182,0.16444787681136983,9.8179232749377676E-2]
[29.901051959313918,8.9214273543590199,9.1314771179734837,1.8447043942775987,null,null,null,null,null,null,null,null,null,null,null,null,null,null,null,6.9999999997962732,2.8605113701517841,0.19363480334919192,7.6963547539546429E-2]
[29.962520969274919,9.1409056011009717,9.2451473863973401,1.8821441842181079,null,null,null,null,null,null,null,null,null,null,null,null,null,null,null,7.1666666664580898,2.8947231343978994,0.21574983461475986,5.5747854336026123E-2]
[30.018881628348026,9.3198510455583126,9.3512561440971069,1.8794345720166077,null,null,null,null,null,null,null,null,null,null,null,null,null,null,null,7.3333333331199055,2.9320320019069879,0.23079297060807366,3.4532161132589098E-2]
[30.077913562126923,9.6426810772611162,9.4620591570341315,1.8363361494087844,null,null,null,null,null,null,null,null,null,null,null,null,null,null,null,7.4999999997817213,2.9712593234671738,0.23876421133179784,1.3316475922674577E-2]
[30.147781588311773,9.6630212543003005,9.5895887346914996,1.7496322992318376,null,null,null,null,null,null,null,null,null,null,null,null,null,null,null,7.6666666664435379,3.0112264510722939,0.23966491348468583,-7.4464194814107846E-3]
[30.23810956365196,9.8054199161609681,9.7447987845771884,1.5996873874840556,null,null,null,null,null,null,null,null,null,null,null,null,null,null,null,7.8333333331053536,3.0510147381141026,0.2380976011647124,-1.9629418092375695E-3]
[30.361222689680289,10.1009536653353,9.9329995171793826,1.3519190895006081,null,null,null,null,null,null,null,null,null,null,null,null,null,null,null,7.9999999997671694,3.090693972992467,0.23835811535094331,3.5205438567079569E-3]
[30.533670484146569,10.113295776244147,10.145182769679167,1.0227742749426432,null,null,null,null,null,null,null,null,null,null,null,null,null,null,null,8.166666666428986,3.1305687934582704,0.2404464560380494,9.0040135352753951E-3]
[30.778127179655712,10.440725985515027,10.355608730750546,0.63017830603041758,null,null,null,null,null,null,null,null,null,null,null,null,null,null,null,8.3333333330908026,3.1709438372623948,0.24436262323668889,1.4487499201137654E-2]
[31.125704392616171,10.394143875602518,10.522684143376656,0.36544525834054203,null,null,null,null,null,null,null,null,null,null,null,null,null,null,null,8.4999999997526174,3.2127537529016355,0.26222237110182117,9.7471542842681058E-2]
[31.618546727986541,10.693185093665297,10.677008150373402,0.24039960659663734,null,null,null,null,null,null,null,null,null,null,null,null,null,null,null,8.6666666664144341,3.2599789458197872,0.30942692318371035,0.18566756932976952]
[32.312233893026132,10.788842607386293,10.793753306373763,0.11054590295780142,null,null,null,null,null,null,null,null,null,null,null,null,null,null,null,8.8333333330762507,3.3175190039951286,0.38603015286811038,0.2738636038106303]
[33.276938258495647,10.877864857281752,10.882167042175245,9.4697723297037462E-2,null,null,null,null,null,null,null,null,null,null,null,null,null,null,null,8.9999999997380655,3.3903460184422864,0.4933681237508184,0.37027138957086025]
[34.595723087841179,11.051299680096768,11.055811290940555,0.17623468778773954,null,null,null,null,null,null,null,null,null,null,null,null,null,null,null,9.1666666663998821,3.4837436667765198,0.63291077901771609,0.46688793633957631]
[36.358880750776734,11.370292142789795,11.363296617184082,0.10729439203867115,null,null,null,null,null,null,null,null,null,null,null,null,null,null,null,9.3333333330616988,3.6039347389667129,0.82271991488532481,0.69034921783128422]
[38.657043337298092,11.419295233251525,11.423452697093367,2.3984114612561593E-2,null,null,null,null,null,null,null,null,null,null,null,null,null,null,null,9.4999999997235136,3.7624362958580515,1.0913088884059261,0.89306457434413911]
[41.584617293847259,11.628946382172252,11.627354277970312,6.5317783107073119E-2,null,null,null,null,null,null,null,null,null,null,null,null,null,null,null,9.6666666663853302,3.9701736511568306,1.405575552038181,0.93282872631778413]
[45.275601847970393,11.730370279959102,11.730885070584325,2.0239006856164813E-2,null,null,null,null,null,null,null,null,null,null,null,null,null,null,null,9.8333333330471469,4.2282812400545851,1.6731273266693101,0.59354294282960496]
[49.999999998544808,11.913765583538456,11.913683305983376,4.8066328369968971E-2,null,null,null,null,null,null,null,null,null,null,null,null,null,null,null,9.9999999997089617,4.5200536754230942,1.8099075978839589,0.22271555800905488]
[null,null,null,null,null,null,null,null,null,null,null,null,null,null,null,null,null,null,null,10.166666666370778,4.8193077796195789,1.7207090287477769,-0.78250398165659352]
[null,null,null,null,null,null,null,null,null,null,null,null,null,null,null,null,null,null,null,10.333333333032595,5.0805989896209773,1.4049640901383833,-0.98358313499645067]
[null,null,null,null,null,null,null,null,null,null,null,null,null,null,null,null,null,null,null,10.49999999969441,5.2884091464244163,1.0951869747247818,-0.85845505109450193]
[null,null,null,null,null,null,null,null,null,null,null,null,null,null,null,null,null,null,null,10.666666666356226,5.4486813642849947,0.83729180375463508,-0.68580395766290925]
[null,null,null,null,null,null,null,null,null,null,null,null,null,null,null,null,null,null,null,10.833333333018043,5.5709817104671666,0.64081250218439401,-0.49326438936306899]
[null,null,null,null,null,null,null,null,null,null,null,null,null,null,null,null,null,null,null,10.999999999679858,5.6657943774104655,0.50510178926237537,-0.34663966099533694]
[null,null,null,null,null,null,null,null,null,null,null,null,null,null,null,null,null,null,null,11.166666666341674,5.741185676682619,0.40445466534433649,-0.25733239540747888]
[null,null,null,null,null,null,null,null,null,null,null,null,null,null,null,null,null,null,null,11.333333333003491,5.8022807263411966,0.33357192116139561,-0.16917726420754825]
[null,null,null,null,null,null,null,null,null,null,null,null,null,null,null,null,null,null,null,11.499999999665306,5.8535548825638033,0.28390931925708351,-0.12883869971633535]
[null,null,null,null,null,null,null,null,null,null,null,null,null,null,null,null,null,null,null,11.666666666327123,5.8976713332400861,0.24769290078917938,-8.8500135225372215E-2]
[null,null,null,null,null,null,null,null,null,null,null,null,null,null,null,null,null,null,null,11.833333332988939,5.9368711089435244,0.22492266576301234,-4.8161602708665679E-2]
[null,null,null,null,null,null,null,null,null,null,null,null,null,null,null,null,null,null,null,11.999999999650754,5.9732884065172458,0.21263479886798783,-3.5146525691833012E-2]
[null,null,null,null,null,null,null,null,null,null,null,null,null,null,null,null,null,null,null,12.166666666312571,6.0077364009292982,0.20063420144518171,-3.6855318798979672E-2]
[null,null,null,null,null,null,null,null,null,null,null,null,null,null,null,null,null,null,null,12.333333332974387,6.0401368771641604,0.18806401114282997,-3.8564111906043065E-2]
[null,null,null,null,null,null,null,null,null,null,null,null,null,null,null,null,null,null,null,12.499999999636202,6.0703949030756261,0.17492422796626164,-4.0272905013189725E-2]
[null,null,null,null,null,null,null,null,null,null,null,null,null,null,null,null,null,null,null,12.666666666298019,6.098415549646953,0.16121665757509859,-4.1655191298747243E-2]
[null,null,null,null,null,null,null,null,null,null,null,null,null,null,null,null,null,null,null,12.833333332959835,6.1242071815480026,0.14873917370727863,-3.3218132246765938E-2]
[null,null,null,null,null,null,null,null,null,null,null,null,null,null,null,null,null,null,null,12.99999999962165,6.148153361647676,0.13907404830831385,-2.4781073194951174E-2]
[null,null,null,null,null,null,null,null,null,null,null,null,null,null,null,null,null,null,null,13.166666666283467,6.1707228163571628,0.13222128138353337,-1.634398216863003E-2]
[null,null,null,null,null,null,null,null,null,null,null,null,null,null,null,null,null,null,null,13.333333332945283,6.1923842720876552,0.12818087292227906,-7.906907129520439E-3]
[null,null,null,null,null,null,null,null,null,null,null,null,null,null,null,null,null,null,null,13.499999999607098,6.2136064552503409,0.12695282292987994,5.3016790958914978E-4]
[null,null,null,null,null,null,null,null,null,null,null,null,null,null,null,null,null,null,null,13.666666666268915,6.2348580922564123,0.12853713140100698,8.9672429486987396E-3]
[null,null,null,null,null,null,null,null,null,null,null,null,null,null,null,null,null,null,null,13.833333332930732,6.2565592194605832,0.13194062595929115,1.066673149872035E-2]
[null,null,null,null,null,null,null,null,null,null,null,null,null,null,null,null,null,null,null,13.999999999592546,6.2788528308246736,0.13563143332579516,1.147729911177383E-2]
[null,null,null,null,null,null,null,null,null,null,null,null,null,null,null,null,null,null,null,14.166666666254363,6.3017840703064261,0.13959243356305087,1.2287882712122132E-2]
[null,null,null,null,null,null,null,null,null,null,null,null,null,null,null,null,null,null,null,14.33333333291618,6.3253979700508927,0.14382362667105822,1.3098466312303899E-2]
[null,null,null,null,null,null,null,null,null,null,null,null,null,null,null,null,null,null,null,14.499999999577994,6.3497395622031245,0.14832501264981726,1.3909033925357379E-2]
[null,null,null,null,null,null,null,null,null,null,null,null,null,null,null,null,null,null,null,14.666666666239811,6.3748538789081737,0.153096591499328,1.4719617525705679E-2]
[null,null,null,null,null,null,null,null,null,null,null,null,null,null,null,null,null,null,null,14.833333332901628,6.4007859523110913,0.15813836321426131,1.5530185138759159E-2]
[null,null,null,null,null,null,null,null,null,null,null,null,null,null,null,null,null,null,null,14.999999999563443,6.4275808144156823,0.16345009566563454,1.623303092043786E-2]
[null,null,null,null,null,null,null,null,null,null,null,null,null,null,null,null,null,null,null,15.166666666225259,6.4551966136120056,0.16748543118215775,7.9872268802898324E-3]
[null,null,null,null,null,null,null,null,null,null,null,null,null,null,null,null,null,null,null,15.333333332887076,6.4832561481232966,0.16877217084634771,-2.5856117248010732E-4]
[null,null,null,null,null,null,null,null,null,null,null,null,null,null,null,null,null,null,null,15.499999999548891,6.511301318639493,0.16731031464754623,-8.5043492253333141E-3]
[null,null,null,null,null,null,null,null,null,null,null,null,null,null,null,null,null,null,null,15.666666666210707,6.5388740258505313,0.16309986259108239,-1.6750121290974966E-2]
[null,null,null,null,null,null,null,null,null,null,null,null,null,null,null,null,null,null,null,15.833333332872524,6.5655161704463483,0.15614081467162713,-2.4995909343828171E-2]
[null,null,null,null,null,null,null,null,null,null,null,null,null,null,null,null,null,null,null,15.999999999534339,6.5907696531168813,0.14643317088918045,-3.3241713383809664E-2]
[null,null,null,null,null,null,null,null,null,null,null,null,null,null,null,null,null,null,null,16.166666666196157,6.6141763745520654,0.1339769312490714,-4.1487485449534581E-2]
[null,null,null,null,null,null,null,null,null,null,null,null,null,null,null,null,null,null,null,16.333333332857972,6.6352782354418389,0.11877209575130002,-4.9733257515134605E-2]
[null,null,null,null,null,null,null,null,null,null,null,null,null,null,null,null,null,null,null,16.499999999519787,6.6536171364761376,0.1008186643905372,-5.7979045567987809E-2]
[null,null,null,null,null,null,null,null,null,null,null,null,null,null,null,null,null,null,null,16.666666666181605,6.6687498205856004,8.0712231029029594E-2,-5.8293498032064434E-2]
[null,null,null,null,null,null,null,null,null,null,null,null,null,null,null,null,null,null,null,16.83333333284342,6.6806712218128785,6.2848761023967567E-2,-4.8896710683262505E-2]
[null,null,null,null,null,null,null,null,null,null,null,null,null,null,null,null,null,null,null,16.999999999505235,6.6898761376740667,4.8117538888072096E-2,-3.9499987283327612E-2]
[null,null,null,null,null,null,null,null,null,null,null,null,null,null,null,null,null,null,null,17.166666666167053,6.6968866094821253,3.6518564632001323E-2,-3.0103231908969613E-2]
[null,null,null,null,null,null,null,null,null,null,null,null,null,null,null,null,null,null,null,17.333333332828868,6.7022246785500164,2.8051838255755256E-2,-2.0706492521823168E-2]
[null,null,null,null,null,null,null,null,null,null,null,null,null,null,null,null,null,null,null,17.499999999490683,6.7064123861907019,2.2717359748675746E-2,-1.1309769121888278E-2]
[null,null,null,null,null,null,null,null,null,null,null,null,null,null,null,null,null,null,null,17.666666666152501,6.7099717737171423,2.051512912675001E-2,-1.9130137475198686E-3]
[null,null,null,null,null,null,null,null,null,null,null,null,null,null,null,null,null,null,null,17.833333332814316,6.7134248824423004,2.1445146384648971E-2,7.4837256396265766E-3]
[null,null,null,null,null,null,null,null,null,null,null,null,null,null,null,null,null,null,null,17.999999999476131,6.7172937536791366,2.5507411517043565E-2,1.6880481013984577E-2]
[null,null,null,null,null,null,null,null,null,null,null,null,null,null,null,null,null,null,null,18.166666666137949,6.7221004287406148,3.2701924523933786E-2,2.6277204413929875E-2]
[null,null,null,null,null,null,null,null,null,null,null,null,null,null,null,null,null,null,null,18.333333332799764,6.7283669489396942,4.3028685415977784E-2,3.5673959788287878E-2]
[null,null,null,null,null,null,null,null,null,null,null,null,null,null,null,null,null,null,null,18.499999999461579,6.7365941691292548,5.5804103531745655E-2,3.7744815275480521E-2]
[null,null,null,null,null,null,null,null,null,null,null,null,null,null,null,null,null,null,null,18.666666666123398,6.7469079057878156,6.7766500018802633E-2,3.403325621519588E-2]
[null,null,null,null,null,null,null,null,null,null,null,null,null,null,null,null,null,null,null,18.833333332785212,6.7591123788159653,7.8491702777025552E-2,3.0321665180446499E-2]
[null,null,null,null,null,null,null,null,null,null,null,null,null,null,null,null,null,null,null,18.999999999447027,6.7730013892599583,8.7979711811743494E-2,2.6610074145738755E-2]
[null,null,null,null,null,null,null,null,null,null,null,null,null,null,null,null,null,null,null,19.166666666108846,6.7883687381660511,9.6230527128285517E-2,2.2898499098200929E-2]
[null,null,null,null,null,null,null,null,null,null,null,null,null,null,null,null,null,null,null,19.33333333277066,6.8050082265804983,0.10324414872132257,1.9186924050704737E-2]
[null,null,null,null,null,null,null,null,null,null,null,null,null,null,null,null,null,null,null,19.499999999432475,6.8227136555495553,0.10902057659085462,1.5475349003166911E-2]
[null,null,null,null,null,null,null,null,null,null,null,null,null,null,null,null,null,null,null,19.666666666094294,6.8412788261194786,0.11355981074221076,1.1763789942840641E-2]
[null,null,null,null,null,null,null,null,null,null,null,null,null,null,null,null,null,null,null,19.833333332756109,6.8604975393365235,0.11686185116473286,8.0521829209213389E-3]
[null,null,null,null,null,null,null,null,null,null,null,null,null,null,null,null,null,null,null,19.999999999417923,6.8801635962469438,0.11892669786907903,4.3406238605950683E-3]
[null,null,null,null,null,null,null,null,null,null,null,null,null,null,null,null,null,null,null,20.166666666079742,6.9000707978969977,0.11975435084459116,6.2901683863413244E-4]
[null,null,null,null,null,null,null,null,null,null,null,null,null,null,null,null,null,null,null,20.333333332741557,6.9200129453884243,0.11934484985146436,-3.0737812297183275E-3]
[null,null,null,null,null,null,null,null,null,null,null,null,null,null,null,null,null,null,null,20.499999999403371,6.9397872113829155,0.11775728164119195,-6.448281908787476E-3]
[null,null,null,null,null,null,null,null,null,null,null,null,null,null,null,null,null,null,null,20.66666666606519,6.9592032398816919,0.11504487506976505,-9.8227825878566231E-3]
[null,null,null,null,null,null,null,null,null,null,null,null,null,null,null,null,null,null,null,20.833333332727005,6.9780735578240041,0.11120763012652549,-1.3197315241432148E-2]
[null,null,null,null,null,null,null,null,null,null,null,null,null,null,null,null,null,null,null,20.99999999938882,6.9962106921490994,0.10624554682213144,-1.6571815920501297E-2]
[null,null,null,null,null,null,null,null,null,null,null,null,null,null,null,null,null,null,null,21.166666666050638,7.0134271697962305,0.10015862515125383,-1.9946348573993553E-2]
[null,null,null,null,null,null,null,null,null,null,null,null,null,null,null,null,null,null,null,21.333333332712453,7.0295355177046455,9.2946865119221719E-2,-2.3320849253062704E-2]
[null,null,null,null,null,null,null,null,null,null,null,null,null,null,null,null,null,null,null,21.499999999374268,7.0443482628135943,8.461026672070604E-2,-2.6695365919343406E-2]
[null,null,null,null,null,null,null,null,null,null,null,null,null,null,null,null,null,null,null,21.666666666036086,7.0576779320623269,7.5148829955706792E-2,-3.0069882585665741E-2]
[null,null,null,null,null,null,null,null,null,null,null,null,null,null,null,null,null,null,null,21.833333332697901,7.0693370523900931,6.4562554829553045E-2,-3.3444399251946443E-2]
[null,null,null,null,null,null,null,null,null,null,null,null,null,null,null,null,null,null,null,21.999999999359716,7.0791381507361422,5.285144133691573E-2,-3.6818915918268781E-2]
[null,null,null,null,null,null,null,null,null,null,null,null,null,null,null,null,null,null,null,22.166666666021534,7.0868937540397248,4.0015489483123917E-2,-4.0193416597358748E-2]
[null,null,null,null,null,null,null,null,null,null,null,null,null,null,null,null,null,null,null,22.333333332683349,7.0924694186630903,2.7419718651076938E-2,-3.1889099362992029E-2]
[null,null,null,null,null,null,null,null,null,null,null,null,null,null,null,null,null,null,null,22.499999999345164,7.0962776239183496,1.9009383513178067E-2,-1.8586188589269886E-2]
[null,null,null,null,null,null,null,null,null,null,null,null,null,null,null,null,null,null,null,22.666666666006982,7.0990532622106466,1.5033349392450478E-2,-5.2833097899656466E-3]
[null,null,null,null,null,null,null,null,null,null,null,null,null,null,null,null,null,null,null,22.833333332668797,7.1015353837108615,1.5491616304881385E-2,8.0195849965449435E-3]
[null,null,null,null,null,null,null,null,null,null,null,null,null,null,null,null,null,null,null,22.999999999330612,7.1044630385898753,2.0384184245141719E-2,2.1322511757473437E-2]
[null,null,null,null,null,null,null,null,null,null,null,null,null,null,null,null,null,null,null,23.16666666599243,7.1085752770185691,2.9711053207902408E-2,3.4625422531205992E-2]
[null,null,null,null,null,null,null,null,null,null,null,null,null,null,null,null,null,null,null,23.333333332654245,7.1146111491678239,4.3472223193163455E-2,4.792831731771658E-2]
[null,null,null,null,null,null,null,null,null,null,null,null,null,null,null,null,null,null,null,23.49999999931606,7.1233097052085208,6.1667694200924855E-2,6.1231212104237577E-2]
[null,null,null,null,null,null,null,null,null,null,null,null,null,null,null,null,null,null,null,23.666666665977878,7.13540999531154,8.4297466241844754E-2,7.4534122877949319E-2]
[null,null,null,null,null,null,null,null,null,null,null,null,null,null,null,null,null,null,null,23.833333332639693,7.1516510696477624,0.111361539305265,8.7837017664449499E-2]
[null,null,null,null,null,null,null,null,null,null,null,null,null,null,null,null,null,null,null,23.999999999301508,7.1727581087384138,0.14214801707326952,8.9028976196402293E-2]
[null,null,null,null,null,null,null,null,null,null,null,null,null,null,null,null,null,null,null,24.166666665963326,7.1987243150723135,0.1682985061282192,6.7895113535309887E-2]
[null,null,null,null,null,null,null,null,null,null,null,null,null,null,null,null,null,null,null,24.333333332625141,7.2284624710611984,0.1874043683064571,4.6761202912499536E-2]
[null,null,null,null,null,null,null,null,null,null,null,null,null,null,null,null,null,null,null,24.499999999286956,7.2607984722262389,0.19946560361331228,2.5627324264195565E-2]
[null,null,null,null,null,null,null,null,null,null,null,null,null,null,null,null,null,null,null,24.666666665948775,7.2945582140886085,0.20448221204878475,4.4934456158083249E-3]
[null,null,null,null,null,null,null,null,null,null,null,null,null,null,null,null,null,null,null,24.833333332610589,7.3285675921694766,0.20245419360754546,-1.6640433032495645E-2]
[null,null,null,null,null,null,null,null,null,null,null,null,null,null,null,null,null,null,null,24.999999999272404,7.3616525019900161,0.1933815483002525,-3.7774295693671328E-2]
[null,null,null,null,null,null,null,null,null,null,null,null,null,null,null,null,null,null,null,25.166666665934223,7.3926388390713997,0.17726427611091872,-5.8908190329186857E-2]
[null,null,null,null,null,null,null,null,null,null,null,null,null,null,null,null,null,null,null,25.333333332596037,7.4203524989347978,0.15410237705553129,-8.0042068977490832E-2]
[null,null,null,null,null,null,null,null,null,null,null,null,null,null,null,null,null,null,null,25.499999999257852,7.4436693975898596,0.12575507696876606,-7.8235306238017985E-2]
[null,null,null,null,null,null,null,null,null,null,null,null,null,null,null,null,null,null,null,25.666666665919671,7.4626995860586129,0.10403769790504311,-5.2095144201475693E-2]
[null,null,null,null,null,null,null,null,null,null,null,null,null,null,null,null,null,null,null,25.833333332581486,7.4788356012739374,9.1033711318451602E-2,-2.5954950190593563E-2]
[null,null,null,null,null,null,null,null,null,null,null,null,null,null,null,null,null,null,null,25.9999999992433,7.4935296753140985,8.67431171983334E-2,1.8522783307701253E-4]
[null,null,null,null,null,null,null,null,null,null,null,null,null,null,null,null,null,null,null,26.166666665905119,7.5082340402573609,9.1165915550017573E-2,2.6325405856747589E-2]
[null,null,null,null,null,null,null,null,null,null,null,null,null,null,null,null,null,null,null,26.333333332566934,7.5244009281819881,0.10430210636817505,5.2465583880418165E-2]
[null,null,null,null,null,null,null,null,null,null,null,null,null,null,null,null,null,null,null,26.499999999228748,7.543482571166245,0.12615168965813492,7.8605761904088745E-2]
[null,null,null,null,null,null,null,null,null,null,null,null,null,null,null,null,null,null,null,26.666666665890567,7.5669201369895633,0.1560222500095354,9.0401590218885733E-2]
[null,null,null,null,null,null,null,null,null,null,null,null,null,null,null,null,null,null,null,26.833333332552382,7.5952143533813015,0.18222573144297197,6.6842851257966893E-2]
[null,null,null,null,null,null,null,null,null,null,null,null,null,null,null,null,null,null,null,26.999999999214197,7.6272220610639767,0.20057629258347418,4.3284080322541676E-2]
[null,null,null,null,null,null,null,null,null,null,null,null,null,null,null,null,null,null,null,27.166666665876015,7.6616344399895135,0.2110739334363711,1.972530938703319E-2]
[null,null,null,null,null,null,null,null,null,null,null,null,null,null,null,null,null,null,null,27.33333333253783,7.6971426701098338,0.21371865400166276,-3.8334295740521836E-3]
[null,null,null,null,null,null,null,null,null,null,null,null,null,null,null,null,null,null,null,27.499999999199645,7.7324379313768636,0.20851045427934917,-2.7392184522265845E-2]
[null,null,null,null,null,null,null,null,null,null,null,null,null,null,null,null,null,null,null,27.666666665861463,7.7663174100178933,0.19820119339941178,-2.7207228471785271E-2]
[null,null,null,null,null,null,null,null,null,null,null,null,null,null,null,null,null,null,null,27.833333332523278,7.7986944130431031,0.19090637631813898,-1.6572311524059503E-2]
[null,null,null,null,null,null,null,null,null,null,null,null,null,null,null,null,null,null,null,27.999999999185093,7.8301507322134034,0.18715653211754521,-5.9373626019106271E-3]
[null,null,null,null,null,null,null,null,null,null,null,null,null,null,null,null,null,null,null,28.166666665846911,7.8612771963413008,0.18695166078164327,4.6975223713087624E-3]
[null,null,null,null,null,null,null,null,null,null,null,null,null,null,null,null,null,null,null,28.333333332508726,7.8927635297395575,0.19395199220038553,6.0303921859662185E-2]
[null,null,null,null,null,null,null,null,null,null,null,null,null,null,null,null,null,null,null,28.499999999170541,7.9277152071752059,0.23122287557837556,0.16321844676764746]
[null,null,null,null,null,null,null,null,null,null,null,null,null,null,null,null,null,null,null,28.666666665832359,7.9717345764590002,0.30279859922181812,0.2661329716757993]
[null,null,null,null,null,null,null,null,null,null,null,null,null,null,null,null,null,null,null,28.833333332494174,8.0305262905348318,0.4081000678203251,0.36037179642500405]
[null,null,null,null,null,null,null,null,null,null,null,null,null,null,null,null,null,null,null,28.999999999155989,8.1092951190074949,0.54177053780235751,0.4415697887593944]
[null,null,null,null,null,null,null,null,null,null,null,null,null,null,null,null,null,null,null,29.166666665817807,8.2125995512659742,0.7029249762302866,0.53734488861610485]
[null,null,null,null,null,null,null,null,null,null,null,null,null,null,null,null,null,null,null,29.333333332479622,8.3462059920003622,0.90980494447540072,0.70376853149261986]
[null,null,null,null,null,null,null,null,null,null,null,null,null,null,null,null,null,null,null,29.499999999141437,8.5189579261834609,1.173630053122616,0.88539892223017402]
[null,null,null,null,null,null,null,null,null,null,null,null,null,null,null,null,null,null,null,29.666666665803255,8.7405712164179672,1.4869333399018845,0.89054952217687011]
[null,null,null,null,null,null,null,null,null,null,null,null,null,null,null,null,null,null,null,29.83333333246507,9.0108302989836648,1.7410741538706376,0.62336212995066753]
[null,null,null,null,null,null,null,null,null,null,null,null,null,null,null,null,null,null,null,29.999999999126885,9.3156319267701111,1.8860715306788145,7.1463283295073857E-2]
[null,null,null,null,null,null,null,null,null,null,null,null,null,null,null,null,null,null,null,30.166666665788703,9.6230530640774159,1.7587843729544086,-0.70885470297674902]
[null,null,null,null,null,null,null,null,null,null,null,null,null,null,null,null,null,null,null,30.333333332450518,9.89300553025166,1.4629190269629937,-1.0281218437201993]
[null,null,null,null,null,null,null,null,null,null,null,null,null,null,null,null,null,null,null,30.499999999112333,10.10824458672597,1.127611491189517,-0.92409424118169936]
[null,null,null,null,null,null,null,null,null,null,null,null,null,null,null,null,null,null,null,30.666666665774152,10.271780737699045,0.84025482556130038,-0.813277701231096]
[null,null,null,null,null,null,null,null,null,null,null,null,null,null,null,null,null,null,null,30.833333332435966,10.39020169081958,0.58889184507586445,-0.64693888649909215]
[null,null,null,null,null,null,null,null,null,null,null,null,null,null,null,null,null,null,null,30.999999999097781,10.473283290779515,0.42523677922006986,-0.33530311329409396]
[null,null,null,null,null,null,null,null,null,null,null,null,null,null,null,null,null,null,null,31.1666666657596,10.537691837262306,0.36214371223396807,-0.10430562014710965]
[null,null,null,null,null,null,null,null,null,null,null,null,null,null,null,null,null,null,null,31.333333332421414,10.595002197574242,0.32462843519333029,-0.12076953837682579]
[null,null,null,null,null,null,null,null,null,null,null,null,null,null,null,null,null,null,null,31.499999999083229,10.645603138055275,0.2816251862835879,-0.13723345660654193]
[null,null,null,null,null,null,null,null,null,null,null,null,null,null,null,null,null,null,null,31.666666665745048,10.688589198429771,0.23370962776395224,-0.14177561525604182]
[null,null,null,null,null,null,null,null,null,null,null,null,null,null,null,null,null,null,null,31.833333332406863,10.723836415509352,0.19059318224478736,-0.11694785940326657]
[null,null,null,null,null,null,null,null,null,null,null,null,null,null,null,null,null,null,null,31.999999999068677,10.752586530105978,0.15575267388810204,-9.2120071576234766E-2]
[null,null,null,null,null,null,null,null,null,null,null,null,null,null,null,null,null,null,null,32.166666665730496,10.776218865079171,0.12918810270455447,-6.729218782585035E-2]
[null,null,null,null,null,null,null,null,null,null,null,null,null,null,null,null,null,null,null,32.333333332392314,10.796112507809209,0.11086572214192432,-4.4051258643393071E-2]
[null,null,null,null,null,null,null,null,null,null,null,null,null,null,null,null,null,null,null,32.499999999054126,10.813481532152968,9.8232893608968364E-2,-3.1757956266637036E-2]
[null,null,null,null,null,null,null,null,null,null,null,null,null,null,null,null,null,null,null,32.666666665715944,10.82908622215608,8.9697807807932864E-2,-1.9464749813108698E-2]
[null,null,null,null,null,null,null,null,null,null,null,null,null,null,null,null,null,null,null,32.833333332377762,10.843609534942027,8.5260464738817807E-2,-7.1715433595803645E-3]
[null,null,null,null,null,null,null,null,null,null,null,null,null,null,null,null,null,null,null,32.999999999039574,10.857734427634291,8.4920864422939488E-2,5.1216950683294479E-3]
[null,null,null,null,null,null,null,null,null,null,null,null,null,null,null,null,null,null,null,33.166666665701392,10.872143857356358,8.8679006838981625E-2,1.7414901521899416E-2]
[null,null,null,null,null,null,null,null,null,null,null,null,null,null,null,null,null,null,null,33.33333333236321,10.887516842021457,9.6324721332724614E-2,2.5992392240055531E-2]
[null,null,null,null,null,null,null,null,null,null,null,null,null,null,null,null,null,null,null,33.499999999025022,10.904304397242267,0.10520770647510552,2.7304270845882897E-2]
[null,null,null,null,null,null,null,null,null,null,null,null,null,null,null,null,null,null,null,33.66666666568684,10.922608854660952,0.11452798500833059,2.8616149451710263E-2]
[null,null,null,null,null,null,null,null,null,null,null,null,null,null,null,null,null,null,null,33.833333332348658,10.94250309650991,0.12428555692174166,2.9927996083114517E-2]
[null,null,null,null,null,null,null,null,null,null,null,null,null,null,null,null,null,null,null,33.99999999901047,10.964060005021533,0.13448042224731316,3.1239906663364993E-2]
[null,null,null,null,null,null,null,null,null,null,null,null,null,null,null,null,null,null,null,34.166666665672288,10.987352462428227,0.14511258096372884,3.2551785269150722E-2]
[null,null,null,null,null,null,null,null,null,null,null,null,null,null,null,null,null,null,null,34.333333332334107,11.012453350962383,0.15618203307098866,3.3863663875019726E-2]
[null,null,null,null,null,null,null,null,null,null,null,null,null,null,null,null,null,null,null,34.499999998995918,11.0394355528564,0.16768877857975079,3.5175574455311831E-2]
[null,null,null,null,null,null,null,null,null,null,null,null,null,null,null,null,null,null,null,34.666666665657736,11.068363726638612,0.17928424304070023,3.1585518202762446E-2]
[null,null,null,null,null,null,null,null,null,null,null,null,null,null,null,null,null,null,null,34.833333332319555,11.099026450400848,0.18811037834091235,2.1381520555291966E-2]
[null,null,null,null,null,null,null,null,null,null,null,null,null,null,null,null,null,null,null,34.999999998981366,11.130877034917948,0.19353517076433999,1.1177522907821492E-2]
[null,null,null,null,null,null,null,null,null,null,null,null,null,null,null,null,null,null,null,35.166666665643184,11.163348589710939,0.19555862030032503,9.7342933716495247E-4]
[null,null,null,null,null,null,null,null,null,null,null,null,null,null,null,null,null,null,null,35.333333332305003,11.195874224300837,0.19418072699150002,-9.2305363358824132E-3]
[null,null,null,null,null,null,null,null,null,null,null,null,null,null,null,null,null,null,null,35.499999998966814,11.22788704820867,0.18940149078457427,-1.9434597932115844E-2]
[null,null,null,null,null,null,null,null,null,null,null,null,null,null,null,null,null,null,null,35.666666665628632,11.258820170955458,0.18122091171152219,-2.963859557950305E-2]
[null,null,null,null,null,null,null,null,null,null,null,null,null,null,null,null,null,null,null,35.833333332290451,11.288106702062226,0.16963898975102751,-3.984268915024286E-2]
[null,null,null,null,null,null,null,null,null,null,null,null,null,null,null,null,null,null,null,35.999999998952262,11.315179751049993,0.15465572493506463,-5.0046686797630066E-2]
[null,null,null,null,null,null,null,null,null,null,null,null,null,null,null,null,null,null,null,36.166666665614081,11.339472427439784,0.13627111724231727,-6.0250716419523655E-2]
[null,null,null,null,null,null,null,null,null,null,null,null,null,null,null,null,null,null,null,36.333333332275899,11.360417840752621,0.11448516666212732,-7.0454778015798719E-2]
[null,null,null,null,null,null,null,null,null,null,null,null,null,null,null,null,null,null,null,36.49999999893771,11.377549463985339,9.1433982713159251E-2,-6.5539733644030068E-2]
[null,null,null,null,null,null,null,null,null,null,null,null,null,null,null,null,null,null,null,36.666666665599529,11.39104058575071,7.0864023920266972E-2,-5.788764667948585E-2]
[null,null,null,null,null,null,null,null,null,null,null,null,null,null,null,null,null,null,null,36.833333332261347,11.401315726403249,5.2844760057385906E-2,-5.0235559714983266E-2]
[null,null,null,null,null,null,null,null,null,null,null,null,null,null,null,null,null,null,null,36.999999998923158,11.408800001764881,3.7376191124516053E-2,-4.2583472750480682E-2]
[null,null,null,null,null,null,null,null,null,null,null,null,null,null,null,null,null,null,null,37.166666665584977,11.413918527657534,2.4458317110999279E-2,-3.493141776038039E-2]
[null,null,null,null,null,null,null,null,null,null,null,null,null,null,null,null,null,null,null,37.333333332246795,11.417096419903132,1.4091138048810002E-2,-2.7279330795862197E-2]
[null,null,null,null,null,null,null,null,null,null,null,null,null,null,null,null,null,null,null,37.499999998908606,11.418758794323601,6.2746539059737993E-3,-1.9627275805764507E-2]
[null,null,null,null,null,null,null,null,null,null,null,null,null,null,null,null,null,null,null,37.666666665570425,11.419330766740867,1.0088647038069517E-3,-1.1975156866825801E-2]
[null,null,null,null,null,null,null,null,null,null,null,null,null,null,null,null,null,null,null,37.833333332232243,11.419237452976855,-1.70622956834868E-3,-4.3230699023082547E-3]
[null,null,null,null,null,null,null,null,null,null,null,null,null,null,null,null,null,null,null,37.999999998894054,11.418903968853492,-1.8706289104930963E-3,3.329017062208642E-3]
[null,null,null,null,null,null,null,null,null,null,null,null,null,null,null,null,null,null,null,38.166666665555873,11.418755430192704,5.1566667737370272E-4,1.0981104026725863E-2]
[null,null,null,null,null,null,null,null,null,null,null,null,null,null,null,null,null,null,null,38.333333332217691,11.419216952816416,5.4526571952517172E-3,1.8633159016818675E-2]
[null,null,null,null,null,null,null,null,null,null,null,null,null,null,null,null,null,null,null,38.499999998879503,11.420713652546553,1.2940342653799088E-2,2.628530993018309E-2]
[null,null,null,null,null,null,null,null,null,null,null,null,null,null,null,null,null,null,null,38.666666665541321,11.423670626290276,2.2972723787930929E-2,3.3324639050197842E-2]
[null,null,null,null,null,null,null,null,null,null,null,null,null,null,null,null,null,null,null,38.833333332203139,11.428396765801413,3.3587128141033221E-2,3.0364766702798963E-2]
[null,null,null,null,null,null,null,null,null,null,null,null,null,null,null,null,null,null,null,38.999999998864951,11.43480983653296,4.3214911810288525E-2,2.7404894355431308E-2]
[null,null,null,null,null,null,null,null,null,null,null,null,null,null,null,null,null,null,null,39.166666665526769,11.442745401704318,5.1856074795696837E-2,2.4445022008022021E-2]
[null,null,null,null,null,null,null,null,null,null,null,null,null,null,null,null,null,null,null,39.333333332188587,11.452039024534887,5.9510617097258169E-2,2.1485181635056659E-2]
[null,null,null,null,null,null,null,null,null,null,null,null,null,null,null,null,null,null,null,39.499999998850399,11.462526268244066,6.6178538714972507E-2,1.8525309287668188E-2]
[null,null,null,null,null,null,null,null,null,null,null,null,null,null,null,null,null,null,null,39.666666665512217,11.474042696051253,7.1859839659497993E-2,1.5565468914702826E-2]
[null,null,null,null,null,null,null,null,null,null,null,null,null,null,null,null,null,null,null,39.833333332174035,11.48642387117585,7.6554519909518365E-2,1.2605596567314355E-2]
[null,null,null,null,null,null,null,null,null,null,null,null,null,null,null,null,null,null,null,39.999999998835847,11.499505356837256,8.0262579475691737E-2,9.6457242199258844E-3]
[null,null,null,null,null,null,null,null,null,null,null,null,null,null,null,null,null,null,null,40.166666665497665,11.513122716254868,8.2984018368676263E-2,6.6859158213419994E-3]
[null,null,null,null,null,null,null,null,null,null,null,null,null,null,null,null,null,null,null,40.333333332159484,11.527111512648089,8.4718836567155675E-2,3.7260114995720513E-3]
[null,null,null,null,null,null,null,null,null,null,null,null,null,null,null,null,null,null,null,40.499999998821295,11.541307309236316,8.5467034081788087E-2,7.6613915218358007E-4]
[null,null,null,null,null,null,null,null,null,null,null,null,null,null,null,null,null,null,null,40.666666665483113,11.555545669238949,8.5228610923231654E-2,-2.193669246358671E-3]
[null,null,null,null,null,null,null,null,null,null,null,null,null,null,null,null,null,null,null,40.833333332144932,11.569662155875388,8.4003567070170079E-2,-5.1535415937887753E-3]
[null,null,null,null,null,null,null,null,null,null,null,null,null,null,null,null,null,null,null,40.999999998806743,11.583492332365033,8.1791902533261532E-2,-8.1134459156003563E-3]
[null,null,null,null,null,null,null,null,null,null,null,null,null,null,null,null,null,null,null,41.166666665468561,11.596871761927281,7.8593617323164139E-2,-1.1073254314142609E-2]
[null,null,null,null,null,null,null,null,null,null,null,null,null,null,null,null,null,null,null,41.33333333213038,11.609636007781534,7.4408711418561618E-2,-1.4033158635954189E-2]
[null,null,null,null,null,null,null,null,null,null,null,null,null,null,null,null,null,null,null,41.499999998792191,11.62162063314719,6.9237184840770238E-2,-1.6992999008919551E-2]
[null,null,null,null,null,null,null,null,null,null,null,null,null,null,null,null,null,null,null,41.666666665454009,11.63266569070097,6.3243520832820685E-2,-1.7952263676646714E-2]
[null,null,null,null,null,null,null,null,null,null,null,null,null,null,null,null,null,null,null,41.833333332115828,11.642718324065822,5.7443612449754426E-2,-1.6848282769902263E-2]
[null,null,null,null,null,null,null,null,null,null,null,null,null,null,null,null,null,null,null,41.999999998777639,11.651834941804662,5.2011701315372527E-2,-1.5744301863157811E-2]
[null,null,null,null,null,null,null,null,null,null,null,null,null,null,null,null,null,null,null,42.166666665439458,11.660076876791532,4.694778741901684E-2,-1.4640320956413362E-2]
[null,null,null,null,null,null,null,null,null,null,null,null,null,null,null,null,null,null,null,42.333333332101276,11.667505461900467,4.2251870782003653E-2,-1.3536308075224985E-2]
[null,null,null,null,null,null,null,null,null,null,null,null,null,null,null,null,null,null,null,42.499999998763087,11.674182030005506,3.7923951372358544E-2,-1.2432327168459717E-2]
[null,null,null,null,null,null,null,null,null,null,null,null,null,null,null,null,null,null,null,42.666666665424906,11.680167913980688,3.3964029222055929E-2,-1.1328314287292156E-2]
[null,null,null,null,null,null,null,null,null,null,null,null,null,null,null,null,null,null,null,42.833333332086724,11.685524446700049,3.0372104309779529E-2,-1.0224301406103779E-2]
[null,null,null,null,null,null,null,null,null,null,null,null,null,null,null,null,null,null,null,42.999999998748535,11.69031296103763,2.7148176635529341E-2,-9.1203524737824369E-3]
[null,null,null,null,null,null,null,null,null,null,null,null,null,null,null,null,null,null,null,43.166666665410354,11.694594789867468,2.4292246209963512E-2,-8.016339592604468E-3]
[null,null,null,null,null,null,null,null,null,null,null,null,null,null,null,null,null,null,null,43.333333332072172,11.698431266063599,2.1804313033082039E-2,-6.9123267114160909E-3]
[null,null,null,null,null,null,null,null,null,null,null,null,null,null,null,null,null,null,null,43.499999998733983,11.701883722500066,1.9684377083568641E-2,-5.8083777790843422E-3]
[null,null,null,null,null,null,null,null,null,null,null,null,null,null,null,null,null,null,null,43.666666665395802,11.705013492050902,1.793243839339774E-2,-4.7043968723294834E-3]
[null,null,null,null,null,null,null,null,null,null,null,null,null,null,null,null,null,null,null,43.83333333205762,11.707881907590147,1.6548496951911192E-2,-3.6003520167284041E-3]
[null,null,null,null,null,null,null,null,null,null,null,null,null,null,null,null,null,null,null,43.999999998719431,11.710550301991841,1.5532552748450862E-2,-2.4963711099735449E-3]
[null,null,null,null,null,null,null,null,null,null,null,null,null,null,null,null,null,null,null,44.16666666538125,11.713080008130021,1.4884605783016746E-2,-1.3923902032186859E-3]
[null,null,null,null,null,null,null,null,null,null,null,null,null,null,null,null,null,null,null,44.333333332043068,11.715532358878724,1.4604656066266986E-2,-2.8840929646382679E-4]
[null,null,null,null,null,null,null,null,null,null,null,null,null,null,null,null,null,null,null,44.49999999870488,11.717968687111989,1.4692703587543442E-2,8.1557161029623636E-4]
[null,null,null,null,null,null,null,null,null,null,null,null,null,null,null,null,null,null,null,44.666666665366698,11.720450325703855,1.5148748368162395E-2,1.9195844914742055E-3]
[null,null,null,null,null,null,null,null,null,null,null,null,null,null,null,null,null,null,null,44.833333332028516,11.723038607528357,1.5972790386807562E-2,3.0235973726573787E-3]
[null,null,null,null,null,null,null,null,null,null,null,null,null,null,null,null,null,null,null,44.999999998690328,11.725794865459537,1.7164829643478943E-2,4.1275782794018296E-3]
[null,null,null,null,null,null,null,null,null,null,null,null,null,null,null,null,null,null,null,45.166666665352146,11.728780432371433,1.8724866148834684E-2,5.2315272117439866E-3]
[null,null,null,null,null,null,null,null,null,null,null,null,null,null,null,null,null,null,null,45.333333332013964,11.732056135470193,2.0626547073621892E-2,5.8803522055052562E-3]
[null,null,null,null,null,null,null,null,null,null,null,null,null,null,null,null,null,null,null,45.499999998675776,11.735655129517195,2.2551639148761432E-2,5.6703441945178887E-3]
[null,null,null,null,null,null,null,null,null,null,null,null,null,null,null,null,null,null,null,45.666666665337594,11.73956914435847,2.4406726613790182E-2,5.4604001323767422E-3]
[null,null,null,null,null,null,null,null,null,null,null,null,null,null,null,null,null,null,null,45.833333331999413,11.743786512557195,2.6191809447391856E-2,5.2503921213789663E-3]
[null,null,null,null,null,null,null,null,null,null,null,null,null,null,null,null,null,null,null,45.999999998661224,11.748295566676546,2.7906887649566458E-2,5.0403201615349703E-3]
[null,null,null,null,null,null,null,null,null,null,null,null,null,null,null,null,null,null,null,46.166666665323042,11.753084639279695,2.9551961241630269E-2,4.8303441249707138E-3]
[null,null,null,null,null,null,null,null,null,null,null,null,null,null,null,null,null,null,null,46.333333331984861,11.758142062929821,3.1127030202267005E-2,4.6202721651267178E-3]
[null,null,null,null,null,null,null,null,null,null,null,null,null,null,null,null,null,null,null,46.499999998646672,11.763456170190095,3.2632094552792951E-2,4.4102641541289419E-3]
[null,null,null,null,null,null,null,null,null,null,null,null,null,null,null,null,null,null,null,46.66666666530849,11.769015293623694,3.4067154282549965E-2,4.2002561431207586E-3]
[null,null,null,null,null,null,null,null,null,null,null,null,null,null,null,null,null,null,null,46.833333331970309,11.774807765793792,3.5432209391538051E-2,3.9902801065773178E-3]
[null,null,null,null,null,null,null,null,null,null,null,null,null,null,null,null,null,null,null,46.99999999863212,11.780821919263564,3.6727259879757203E-2,3.7802720955899508E-3]
[null,null,null,null,null,null,null,null,null,null,null,null,null,null,null,null,null,null,null,47.166666665293938,11.787046086596188,3.7952305736549279E-2,3.5702321101586565E-3]
[null,null,null,null,null,null,null,null,null,null,null,null,null,null,null,null,null,null,null,47.333333331955757,11.793468600354835,3.9107346983230561E-2,3.3602240991504728E-3]
[null,null,null,null,null,null,null,null,null,null,null,null,null,null,null,null,null,null,null,47.499999998617568,11.800077793102682,4.0192383609142915E-2,3.1502480625862157E-3]
[null,null,null,null,null,null,null,null,null,null,null,null,null,null,null,null,null,null,null,47.666666665279386,11.806861997402905,4.1207415614286341E-2,2.9402400515988482E-3]
[null,null,null,null,null,null,null,null,null,null,null,null,null,null,null,null,null,null,null,47.833333331941205,11.813809545818678,4.2152442988002685E-2,2.7301680917444443E-3]
[null,null,null,null,null,null,null,null,null,null,null,null,null,null,null,null,null,null,null,47.999999998603016,11.820908770913174,4.3027465740950108E-2,2.5201600807778935E-3]
[null,null,null,null,null,null,null,null,null,null,null,null,null,null,null,null,null,null,null,48.166666665264835,11.82814800524957,4.3832483894444871E-2,2.3101840441928198E-3]
[null,null,null,null,null,null,null,null,null,null,null,null,null,null,null,null,null,null,null,48.333333331926653,11.835515581391043,4.4567497405854424E-2,2.1001440587823427E-3]
[null,null,null,null,null,null,null,null,null,null,null,null,null,null,null,null,null,null,null,48.499999998588464,11.842999831900764,4.5232506296495043E-2,1.8901040733718651E-3]
[null,null,null,null,null,null,null,null,null,null,null,null,null,null,null,null,null,null,null,48.666666665250283,11.850589089341909,4.5827510577024874E-2,1.6801280368076081E-3]
[null,null,null,null,null,null,null,null,null,null,null,null,null,null,null,null,null,null,null,48.833333331912101,11.858271686277655,4.6352510236785771E-2,1.4701200257994241E-3]
[null,null,null,null,null,null,null,null,null,null,null,null,null,null,null,null,null,null,null,48.999999998573912,11.866035955271176,4.6807505265119592E-2,1.260112014812057E-3]
[null,null,null,null,null,null,null,null,null,null,null,null,null,null,null,null,null,null,null,49.166666665235731,11.873870228885648,4.7192495672684485E-2,1.0500400549784694E-3]
[null,null,null,null,null,null,null,null,null,null,null,null,null,null,null,null,null,null,null,49.333333331897549,11.881762839684244,4.7507481470138585E-2,8.4006401839339571E-4]
[null,null,null,null,null,null,null,null,null,null,null,null,null,null,null,null,null,null,null,49.49999999855936,11.889702120230139,4.775246264682375E-2,6.3008798180832191E-4]
[null,null,null,null,null,null,null,null,null,null,null,null,null,null,null,null,null,null,null,49.666666665221179,11.897676403086511,4.7927439192081846E-2,4.2001602197473442E-4]
[null,null,null,null,null,null,null,null,null,null,null,null,null,null,null,null,null,null,null,49.833333331882997,11.90567402081653,4.8032411127229155E-2,2.1003998543129405E-4]
[null,null,null,null,null,null,null,null,null,null,null,null,null,null,null,null,null,null,null,49.999999998544808,11.913683305983376,4.8067378430949381E-2,0]

{"sheet":"+Eva","index":7,"n_rows":4,"n_cols":3,"rows_kept":4,"cut":false,"hidden":false,"merged":[]}
[null,"           ","Compilation of titration data and essential results obtained with the Evaluation module"]
[]
[]
[null,"Identify the results and add observations (use any gray cell)"]

{"sheet":"Regression","index":8,"n_rows":201,"n_cols":50,"rows_kept":201,"cut":false,"hidden":false,"merged":[]}
[null,"          Titration Data Analysis - Multiple Regression",null,null,null,null,"<--- read important remarks and instructions",null,null,null," pKas of the acids and bases in the solution",null,null,"Click on K2 to Q2; select acids/bases; click on J2; other options, read M1",null,null,null,null,null,null,"          Overall protonation constants = bp = PKp (calculated by the program)",null,null,null,null,null,null,null,null,null,null,"       pKas loaded from the Database ",null,null,null,null,null,null,null,null,null,"Besides enabled macros, the Regression module also requires the Solver,"]
["     Composition of the sample (regression fit, in blue, and equilibrium at initial pH) and of the titrant; all concentrations in mol/L",null,null,null,null,null,null,null,null,null,62,103,31,1,2,3,6,null,"Titrant",null,null,"Titrand",null,null,null,null,null,null,"Titrant",null,null,null,"    Titrand","Click on J2 to use these pKas in the Regression",null,null,null,null,null,null,null,"an Add-In supplement provided by Microsoft with the Office package"]
["SAMPLE \nSpecies",{"$f":"K3","v":"Citric acid"},{"$f":"L3","v":"Glycine"},"Ascorbic acid ","Acetic acid","Ammonia","Carbonic acid","HCl",null,"Acid / Base","Citric acid","Glycine","Ascorbic acid ","Acetic acid","Ammonia","Carbonic acid","HCl","Strong ACID","Strong BASE","Carbonic ac.","Acid / Base",{"$f":"K3","v":"Citric acid"},"Glycine","Ascorbic acid ","Acetic acid","Ammonia","Carbonic acid","HCl","Strong ACID","Strong BASE","Carbonic ac.","Acid / Base",{"$f":"IF(VLOOKUP(K$2,Database!$B$22:$N$301,2)=\"\",\"\",VLOOKUP(K$2,Database!$B$22:$N$301,2))","v":"Citric acid"},{"$f":"IF(VLOOKUP(L$2,Database!$B$22:$N$301,2)=\"\",\"\",VLOOKUP(L$2,Database!$B$22:$N$301,2))","v":"Glycine"},{"$f":"IF(VLOOKUP(M$2,Database!$B$22:$N$301,2)=\"\",\"\",VLOOKUP(M$2,Database!$B$22:$N$301,2))","v":"Ascorbic acid "},{"$f":"IF(VLOOKUP(N$2,Database!$B$22:$N$301,2)=\"\",\"\",VLOOKUP(N$2,Database!$B$22:$N$301,2))","v":"Acetic acid"},{"$f":"IF(VLOOKUP(O$2,Database!$B$22:$N$301,2)=\"\",\"\",VLOOKUP(O$2,Database!$B$22:$N$301,2))","v":"Ammonia"},{"$f":"IF(VLOOKUP(P$2,Database!$B$22:$N$301,2)=\"\",\"\",VLOOKUP(P$2,Database!$B$22:$N$301,2))","v":"Carbonic acid"},{"$f":"IF(VLOOKUP(Q$2,Database!$B$22:$N$301,2)=\"\",\"\",VLOOKUP(Q$2,Database!$B$22:$N$301,2))","v":"HCl"},null,null,"If not already installed, follow the instructions (may change a bit, for different Excel versions)"]
["[B]",{"$f":"IF(K5=\"\",0,(B$11)/M$41)","v":1.2099340361412354E-7},{"$f":"IF(L5=\"\",0,(C$11)/N$41)","v":4.2775185398549572E-9},{"$f":"IF(M5=\"\",0,(D$11)/O$41)","v":0},{"$f":"IF(N5=\"\",0,(E$11)/P$41)","v":0},{"$f":"IF(O5=\"\",0,(F$11)/Q$41)","v":0},{"$f":"IF(P5=\"\",0,(G$11)/R$41)","v":0},{"$f":"IF(Q5=\"\",0,(H$11)/S$41)","v":0},null,"Charge of B",-3,-1,-2,-1,0,-2,-1,-1,-1,-2,"Charge of B",{"$f":"IF(K4=\"\",\"\",K4)","v":-3},{"$f":"IF(L4=\"\",\"\",L4)","v":-1},-2,-1,0,-2,-1,-1,-1,-2,"Charge of  B",{"$f":"IF(VLOOKUP(K$2,Database!$B$22:$N$301,3)=\"\",\"\",VLOOKUP(K$2,Database!$B$22:$N$301,3))","v":-3},{"$f":"IF(VLOOKUP(L$2,Database!$B$22:$N$301,3)=\"\",\"\",VLOOKUP(L$2,Database!$B$22:$N$301,3))","v":-1},{"$f":"IF(VLOOKUP(M$2,Database!$B$22:$N$301,3)=\"\",\"\",VLOOKUP(M$2,Database!$B$22:$N$301,3))","v":-2},{"$f":"IF(VLOOKUP(N$2,Database!$B$22:$N$301,3)=\"\",\"\",VLOOKUP(N$2,Database!$B$22:$N$301,3))","v":-1},{"$f":"IF(VLOOKUP(O$2,Database!$B$22:$N$301,3)=\"\",\"\",VLOOKUP(O$2,Database!$B$22:$N$301,3))","v":0},{"$f":"IF(VLOOKUP(P$2,Database!$B$22:$N$301,3)=\"\",\"\",VLOOKUP(P$2,Database!$B$22:$N$301,3))","v":-2},{"$f":"IF(VLOOKUP(Q$2,Database!$B$22:$N$301,3)=\"\",\"\",VLOOKUP(Q$2,Database!$B$22:$N$301,3))","v":-1},null,null,"1. Open a new blank Excel spreadsheet "]
["[HB]",{"$f":"IF(K5=\"\",0,(B$11*(V$5*$AU41^(-2*V$4))*$D41)/M$41)","v":2.0778132559422889E-4},{"$f":"IF(L5=\"\",0,(C$11*(W$5*$AU41^(-2*W$4))*$D41)/N$41)","v":2.7137463866598537E-2},0,0,0,0,0,null,"pKa1",3.1280000000000001,2.35,4.0999999999999996,4.7569999999999997,9.2439999999999998,6.3520000000000003,-7,-7,15.744999999999999,6.3520000000000003,"bp1",{"$f":"IF(K5=\"\",\"1E-10\",IF(K6=\"\",10^K5,(IF(K7=\"\",10^K6,(IF(K8=\"\",10^K7,(IF(K9=\"\",10^K8,(IF(K10=\"\",10^K9,10^K10))))))))))","v":2488857.3182823951},5997910762.5551224,616595001861.48279,57147.863667186728,1753880501.8417609,21330449131.465843,9.9999999999999995E-8,{"$f":"IF(R5=\"\",\"1E-10\",IF(R6=\"\",10^R5,(IF(R7=\"\",10^R6))))","v":9.9999999999999995E-8},{"$f":"IF(S5=\"\",\"1E-10\",IF(S6=\"\",10^S5,(IF(S7=\"\",10^S6))))","v":5559042572704029},{"$f":"IF(T5=\"\",\"1E-10\",IF(T6=\"\",10^T5,(IF(T7=\"\",10^T6))))","v":21330449131.465843},"pKa1 = logKpn",{"$f":"IF(VLOOKUP(K$2,Database!$B$22:$N$301,4)=\"\",\"\",VLOOKUP(K$2,Database!$B$22:$N$301,4))","v":3.1280000000000001},{"$f":"IF(VLOOKUP(L$2,Database!$B$22:$N$301,4)=\"\",\"\",VLOOKUP(L$2,Database!$B$22:$N$301,4))","v":2.35},{"$f":"IF(VLOOKUP(M$2,Database!$B$22:$N$301,4)=\"\",\"\",VLOOKUP(M$2,Database!$B$22:$N$301,4))","v":4.0999999999999996},{"$f":"IF(VLOOKUP(N$2,Database!$B$22:$N$301,4)=\"\",\"\",VLOOKUP(N$2,Database!$B$22:$N$301,4))","v":4.7569999999999997},{"$f":"IF(VLOOKUP(O$2,Database!$B$22:$N$301,4)=\"\",\"\",VLOOKUP(O$2,Database!$B$22:$N$301,4))","v":9.2439999999999998},{"$f":"IF(VLOOKUP(P$2,Database!$B$22:$N$301,4)=\"\",\"\",VLOOKUP(P$2,Database!$B$22:$N$301,4))","v":6.3520000000000003},{"$f":"IF(VLOOKUP(Q$2,Database!$B$22:$N$301,4)=\"\",\"\",VLOOKUP(Q$2,Database!$B$22:$N$301,4))","v":-7}]
["[H2B]",{"$f":"IF(K6=\"\",0,(B$11*(V$6*$AU41^(-4*V$4-2))*$D41^2)/M$41)","v":1.0238058360395919E-2},{"$f":"IF(L6=\"\",0,(C$11*(W$6*$AU41^(-4*W$4-2))*$D41^2)/N$41)","v":7.9563317856966558E-3},0,0,0,0,0,null,"pKa2",4.7610000000000001,9.7780000000000005,11.79,"","",10.329000000000001,"",null,null,10.329000000000001,"bp2",{"$f":"IF(K6=\"\",\"10E-10\",IF(K7=\"\",V5*10^K5,(IF(K8=\"\",V5*10^K6,(IF(K9=\"\",V5*10^K7,(IF(K10=\"\",V5*10^K8,V5*10^K9))))))))","v":143548943335.36603},{"$f":"IF(L6=\"\",\"1E-10\",IF(L7=\"\",W5*10^L5,(IF(L8=\"\",W5*10^L6,(IF(L9=\"\",W5*10^L7,(IF(L10=\"\",W5*10^L8,W5*10^L9))))))))","v":1342764961137.8711},7762471166286925,"1E-10","1E-10",4.7973344863669224E+16,"1E-10",{"$f":"IF(R6=\"\",\"1E-10\",IF(R7=\"\",AC5*10^R5))","v":"1E-10"},{"$f":"IF(S6=\"\",\"1E-10\",IF(S7=\"\",AD5*10^S5))","v":"1E-10"},{"$f":"IF(T6=\"\",\"1E-10\",IF(T7=\"\",AE5*10^T5))","v":4.7973344863669224E+16},"pKa2 = logKpn-1",{"$f":"IF(VLOOKUP(K$2,Database!$B$22:$N$301,5)=\"\",\"\",VLOOKUP(K$2,Database!$B$22:$N$301,5))","v":4.7610000000000001},{"$f":"IF(VLOOKUP(L$2,Database!$B$22:$N$301,5)=\"\",\"\",VLOOKUP(L$2,Database!$B$22:$N$301,5))","v":9.7780000000000005},{"$f":"IF(VLOOKUP(M$2,Database!$B$22:$N$301,5)=\"\",\"\",VLOOKUP(M$2,Database!$B$22:$N$301,5))","v":11.79},{"$f":"IF(VLOOKUP(N$2,Database!$B$22:$N$301,5)=\"\",\"\",VLOOKUP(N$2,Database!$B$22:$N$301,5))","v":""},{"$f":"IF(VLOOKUP(O$2,Database!$B$22:$N$301,5)=\"\",\"\",VLOOKUP(O$2,Database!$B$22:$N$301,5))","v":""},{"$f":"IF(VLOOKUP(P$2,Database!$B$22:$N$301,5)=\"\",\"\",VLOOKUP(P$2,Database!$B$22:$N$301,5))","v":10.329000000000001},{"$f":"IF(VLOOKUP(Q$2,Database!$B$22:$N$301,5)=\"\",\"\",VLOOKUP(Q$2,Database!$B$22:$N$301,5))","v":""},null,null,"2. Click on the File tab (or the Office button, in Windows XP)(top left corner)"]
["[H3B]",{"$f":"IF(K7=\"\",0,(B$11*(V$7*$AU41^(-6*V$4-6))*$D41^3)/M$41)","v":1.4541022903172647E-2},{"$f":"IF(L7=\"\",0,(C$11*(W$7*$AU41^(-6*W$4-6))*$D41^3)/N$41)","v":0},0,0,0,0,0,null,"pKa3",6.3959999999999999,"","","","","","",null,null,null,"bp3",{"$f":"IF(K7=\"\",\"1E-10\",IF(K8=\"\",V6*10^K5,(IF(K9=\"\",V6*10^K6,(IF(K10=\"\",V6*10^K7,V6*10^K8))))))","v":192752491319094.31},"1E-10","1E-10","1E-10","1E-10","1E-10","1E-10",null,null,null,"pKa3 = logKpn-2",{"$f":"IF(VLOOKUP(K$2,Database!$B$22:$N$301,6)=\"\",\"\",VLOOKUP(K$2,Database!$B$22:$N$301,6))","v":6.3959999999999999},{"$f":"IF(VLOOKUP(L$2,Database!$B$22:$N$301,6)=\"\",\"\",VLOOKUP(L$2,Database!$B$22:$N$301,6))","v":""},{"$f":"IF(VLOOKUP(M$2,Database!$B$22:$N$301,6)=\"\",\"\",VLOOKUP(M$2,Database!$B$22:$N$301,6))","v":""},{"$f":"IF(VLOOKUP(N$2,Database!$B$22:$N$301,6)=\"\",\"\",VLOOKUP(N$2,Database!$B$22:$N$301,6))","v":""},{"$f":"IF(VLOOKUP(O$2,Database!$B$22:$N$301,6)=\"\",\"\",VLOOKUP(O$2,Database!$B$22:$N$301,6))","v":""},{"$f":"IF(VLOOKUP(P$2,Database!$B$22:$N$301,6)=\"\",\"\",VLOOKUP(P$2,Database!$B$22:$N$301,6))","v":""},{"$f":"IF(VLOOKUP(Q$2,Database!$B$22:$N$301,6)=\"\",\"\",VLOOKUP(Q$2,Database!$B$22:$N$301,6))","v":""}]
["[H4B]",{"$f":"IF(K8=\"\",0,(B$11*(V$8*$AU41^(-8*V$4-12))*$D41^4)/M$41)","v":0},{"$f":"IF(L8=\"\",0,(C$11*(W$8*$AU41^(-8*W$4-12))*$D41^4)/N$41)","v":0},0,0,0,0,0,null,"pKa4","","","","","","","","pKw",null,null,"bp4",{"$f":"IF(K8=\"\",\"1E-10\",IF(K9=\"\",V7*10^K5,(IF(K10=\"\",V7*10^K6,V7*10^K7))))","v":"1E-10"},"1E-10","1E-10","1E-10","1E-10","1E-10","1E-10","Kw",null,null,"pKa4 = logKpn-3",{"$f":"IF(VLOOKUP(K$2,Database!$B$22:$N$301,7)=\"\",\"\",VLOOKUP(K$2,Database!$B$22:$N$301,7))","v":""},{"$f":"IF(VLOOKUP(L$2,Database!$B$22:$N$301,7)=\"\",\"\",VLOOKUP(L$2,Database!$B$22:$N$301,7))","v":""},{"$f":"IF(VLOOKUP(M$2,Database!$B$22:$N$301,7)=\"\",\"\",VLOOKUP(M$2,Database!$B$22:$N$301,7))","v":""},{"$f":"IF(VLOOKUP(N$2,Database!$B$22:$N$301,7)=\"\",\"\",VLOOKUP(N$2,Database!$B$22:$N$301,7))","v":""},{"$f":"IF(VLOOKUP(O$2,Database!$B$22:$N$301,7)=\"\",\"\",VLOOKUP(O$2,Database!$B$22:$N$301,7))","v":""},{"$f":"IF(VLOOKUP(P$2,Database!$B$22:$N$301,7)=\"\",\"\",VLOOKUP(P$2,Database!$B$22:$N$301,7))","v":""},{"$f":"IF(VLOOKUP(Q$2,Database!$B$22:$N$301,7)=\"\",\"\",VLOOKUP(Q$2,Database!$B$22:$N$301,7))","v":""},null,null,"3. Click on \"Options\" (bottom left)",null,null,null,"Window for Mac:  skip step 2, click \"Tools\""]
["[H5B]",{"$f":"IF(K9=\"\",0,(B$11*(V$9*$AU41^(-10*V$4-20))*$D41^5)/M$41)","v":0},{"$f":"IF(L9=\"\",0,(C$11*(W$9*$AU41^(-10*W$4-20))*$D41^5)/N$41)","v":0},0,0,0,0,0,"Total","pKa5","","","","","","","",13.997,null,null,"bp5",{"$f":"IF(K9=\"\",\"1E-10\",IF(K10=\"\",V8*10^K5,V8*10^K6))","v":"1E-10"},"1E-10","1E-10","1E-10","1E-10","1E-10","1E-10",{"$f":"10^-R9","v":1.0069316688518014E-14},null,null,"pKa5 = logKpn-4",{"$f":"IF(VLOOKUP(K$2,Database!$B$22:$N$301,8)=\"\",\"\",VLOOKUP(K$2,Database!$B$22:$N$301,8))","v":""},{"$f":"IF(VLOOKUP(L$2,Database!$B$22:$N$301,8)=\"\",\"\",VLOOKUP(L$2,Database!$B$22:$N$301,8))","v":""},{"$f":"IF(VLOOKUP(M$2,Database!$B$22:$N$301,8)=\"\",\"\",VLOOKUP(M$2,Database!$B$22:$N$301,8))","v":""},{"$f":"IF(VLOOKUP(N$2,Database!$B$22:$N$301,8)=\"\",\"\",VLOOKUP(N$2,Database!$B$22:$N$301,8))","v":""},{"$f":"IF(VLOOKUP(O$2,Database!$B$22:$N$301,8)=\"\",\"\",VLOOKUP(O$2,Database!$B$22:$N$301,8))","v":""},{"$f":"IF(VLOOKUP(P$2,Database!$B$22:$N$301,8)=\"\",\"\",VLOOKUP(P$2,Database!$B$22:$N$301,8))","v":""},{"$f":"IF(VLOOKUP(Q$2,Database!$B$22:$N$301,8)=\"\",\"\",VLOOKUP(Q$2,Database!$B$22:$N$301,8))","v":""}]
["[H6B]",{"$f":"IF(K10=\"\",0,(B$11*(V$10*$AU41^(-12*V$4-30))*$D41^6)/M$41)","v":0},{"$f":"IF(L10=\"\",0,(C$11*(W$10*$AU41^(-12*W$4-30))*$D41^6)/N$41)","v":0},0,0,0,0,0,"SS","pKa6","","","","","","","",null,null,null,"bp6",{"$f":"IF(K10=\"\",\"1E-10\",V9*10^K5)","v":"1E-10"},"1E-10","1E-10","1E-10","1E-10","1E-10","1E-10",null,null,null,"pKa6 = logKpn-5",{"$f":"IF(VLOOKUP(K$2,Database!$B$22:$N$301,9)=\"\",\"\",VLOOKUP(K$2,Database!$B$22:$N$301,9))","v":""},{"$f":"IF(VLOOKUP(L$2,Database!$B$22:$N$301,9)=\"\",\"\",VLOOKUP(L$2,Database!$B$22:$N$301,9))","v":""},{"$f":"IF(VLOOKUP(M$2,Database!$B$22:$N$301,9)=\"\",\"\",VLOOKUP(M$2,Database!$B$22:$N$301,9))","v":""},{"$f":"IF(VLOOKUP(N$2,Database!$B$22:$N$301,9)=\"\",\"\",VLOOKUP(N$2,Database!$B$22:$N$301,9))","v":""},{"$f":"IF(VLOOKUP(O$2,Database!$B$22:$N$301,9)=\"\",\"\",VLOOKUP(O$2,Database!$B$22:$N$301,9))","v":""},{"$f":"IF(VLOOKUP(P$2,Database!$B$22:$N$301,9)=\"\",\"\",VLOOKUP(P$2,Database!$B$22:$N$301,9))","v":""},{"$f":"IF(VLOOKUP(Q$2,Database!$B$22:$N$301,9)=\"\",\"\",VLOOKUP(Q$2,Database!$B$22:$N$301,9))","v":""},null,null,"4. Click on \"Add-ins\" (bottom left)"]
["S[HiB]",2.4986983582566409E-2,3.5093799929813735E-2,0,0,0,0,0,{"$f":"SUM(B11:H11)","v":6.0080783512380144E-2},"SS[bases]","","","","  Correction of the pH sensor calibration",null,null,"        Ionic Strength, I (initial)",null,"Sample ions","Titrant ions",null,null,null,null,"   Overall apparent constants recalculated for applied initial I =",{"$f":"AT41","v":1.086213258459855E-2},"and g H+=",{"$f":"S23","v":0.89870439443519512},"recalc. for","g H+=",0.78159398185987139]
["S[H] bound",{"$f":"B5+2*B6+3*B7+4*B8+5*B9+6*B10","v":6.4306966755903999E-2},4.3050127437991845E-2,0,0,0,0,0,{"$f":"SUM(B12:H12)","v":0.10735709419389584},"SS[H] bound",null,null,null," Intersection pH (may be fitted)",null,7,"Other ions","SCk(z=1)",0,0,"bp1",{"$f":"IF(K5=\"\",\"\",(V5*$AB$11^(-2*V$4)))","v":1311297.3746547299},4844330117.9152403,402223518878.47589,46156.591536138665,1753880501.8417609,13914495386.785374,8.0766958857713071E-8,6.1088915247956886E-8,3395958805837007,7960215532.0210819,null,null,null,null,null,null,null,null,null,null,"5. Click on \"Solver\" in the Add-Ins list",null,null,null,"Window for Mac:  check the Solver box; skip 6 na 7"]
["max. free H ",{"$f":"IF(K4=\"\",\"0\",(-K4*B11)-B12)","v":1.0653983991795235E-2},{"$f":"IF(L4=\"\",\"0\",(-L4*C11)-C12)","v":-7.9563275081781099E-3},0,0,0,0,0,{"$f":"SUM(B13:H13)","v":2.6976564836171252E-3},"SS[H] max. free H+ ","(negative results are possible)",null,null," Slope (may be fitted, read comment)",null,1,"mol/L","SCk(z=2)",0,0,"bp2",{"$f":"IF(K6=\"\",\"\",(V6*$AB$11^(-4*V$4-2)))","v":49336535904.802795},{"$f":"IF(L6=\"\",\"\",(W6*$AB$11^(-4*W$4-2)))","v":1084510423718.0114},4089791723460359,"","",2.5275583582488724E+16,"",null,null,1.0936723698247162E+16]
["TITRANT",{"$f":"R3","v":"Strong ACID"},{"$f":"S3","v":"Strong BASE"},{"$f":"T3","v":"Carbonic ac."},null,"Volume of Titrand (mL)",null,"Sample",{"$f":"I18-(I12+I13)","v":1.4363439565651115E-5},"Partial charge balance <--> counterions (opposite signal)",null,null,{"$f":"S15","v":1.3880415343291712E-3},null," Davies equation parameters",null,"(z = ion charge)","1/2.SCkzk2 = Ik",{"$f":"0.5*(S12+S13*4)","v":0},{"$f":"0.5*(T12+T13*4)","v":0},"bp3",{"$f":"IF(K7=\"\",\"\",(V7*$AB$11^(-6*V$4-6)))","v":53505987458896.305},{"$f":"IF(L7=\"\",\"\",(W7*$AB$11^(-6*W$4-6)))","v":""},"","","","","",null,null,null,null,null,null,null,null,null,null,null,null,null,"6. Click on \"Go\" near the bottom of the page"]
["[B]",null,0.1,null,"SAMPLE","Water","Total","Titrand [H]=10-p[H]",{"$f":"D41","v":1.3096149588076179E-3},{"$f":"IF(C41=\"\",B41,C41)","v":2.8861632347106934},"  initial p[H]",null,null,null," for activity coefficient estimation",null,"Minimum","SzjCj",{"$f":"-(S18/S17) - (G16/E16)*(S24- $AC$9/AU41^2/S24)","v":1.3880415343291712E-3},{"$f":"-T18/T17 - (T24- $AC$9/AE11^2/T24)","v":9.9999989519874585E-2},"bp4",{"$f":"IF(K8=\"\",\"\",(V8*$AB$11^(-8*V$4-12)))","v":""},{"$f":"IF(L8=\"\",\"\",(W8*$AB$11^(-8*W$4-12)))","v":""},"","","","",""]
["[HB]",null,null,null,20,0,{"$f":"E16+F16","v":20},"Titrand [OH]=Kw/[H]",{"$f":"AB21/I15","v":9.5196864083425799E-12},{"$f":"-LOG(AB21)-J15","v":11.018070495859396},"  initial p[OH] for ionic strength, I",null,{"$f":"AT41","v":1.086213258459855E-2},null,"A ",0.50900000000000001,"of counterions","1/2.SCjzj2 = Ij",{"$f":"0.5*S17^2*ABS(S15)","v":6.940207671645856E-4},{"$f":"0.5*T17^2*ABS(T15)","v":4.9999994759937293E-2},"bp5",{"$f":"IF(K9=\"\",\"\",(V9*$AB$11^(-10*V$4-20)))","v":""},{"$f":"IF(L9=\"\",\"\",(W9*$AB$11^(-10*W$4-20)))","v":""},"","","","","",null,null,null,null,null,null,null,null,null,null,null,null,null,"7. Check Solver add-in in the pop-on box "]
["[H2B]",null,null,null,"SS",null,null,"Sample CHcalc",{"$f":"I12+ (G16/E16)*(I15-I16)","v":0.10866670914318377},null,null,null,null,null,"b",0.3,"for acids/bases","Counterion charge",1,1,"bp6",{"$f":"IF(K10=\"\",\"\",(V10*$AB$11^(-12*V$4-30)))","v":""},{"$f":"IF(L10=\"\",\"\",(W10*$AB$11^(-12*W$4-30)))","v":""},"","","","",""]
["S[HiB]",{"$f":"B15+B16+B17","v":0},{"$f":"C15+C16+C17","v":0.1},{"$f":"D15+D16+D17","v":0},{"$f":"SUM(B18:D18)","v":0.1},"SS[HiB]",null,"Sample CHreg",0.11006911411707862,"<--- Find CHReg, concentrations (line 11, in blue) and pKas with Solver",null,null,null,null,null,null,"Acid/base ions","SziCi",{"$f":"SUM(V18:AB18)","v":-2.6976564836171026E-3},{"$f":"SUM(AC18:AE18)","v":-1.7801316650853212E-4},"SziCi",{"$f":"K4*B4+(K4+1)*B5+(K4+2)*B6+(K4+3)*B7+(K4+4)*B8+(K4+5)*B9+(K4+6)*B10","v":-1.0653983991795219E-2},7.9563275081781168E-3,0,0,0,0,0,0,-1.7801316650853212E-4,0,null,null,null,null,null,null,null,null,null,null,"8. Click OK; follow steps 1 to 8 only once on each computer"]
["S[H]",{"$f":"B16+2*B17","v":0},{"$f":"C16+2*C17","v":0},{"$f":"D16+2*D17","v":0},{"$f":"SUM(B19:D19)","v":0},"SS [H]          pH",12.889207370986353,"S(|RCH|a×|dpH|b×|RpH|c)",{"$f":"SUM($G$41:$G$201)","v":1.0070398441015401E-5},"<--- Minimize S of weighted residuals product with Solver",null,null,null,null,null,null,"at given pH","1/2.SCizi2 = Ii",{"$f":"0.5*SUM(V19:AB19)","v":9.5133043333102789E-3},{"$f":"0.5*(SUM(AC19:AE19))","v":8.9006583254266059E-5},"Szi2Ci",{"$f":"V4^2*B4+(V4+1)^2*B5+(V4+2)^2*B6+(V4+3)^2*B7+(V4+4)^2*B8+(V4+5)^2*B9+(V4+6)^2*B10","v":1.1070272603405361E-2},7.9563360632151948E-3,0,0,0,0,0,0,1.7801316650853212E-4,0]
[null,null,null,null,null,null,null,"Weights: exponent a",2,"exponent b   ",0,"exponent c  ",0,null,null,null,"Total I ","I = Ii+Ij+Ik+IH+IOH",{"$f":"S19+S16+S14+0.5*S24/L41+0.5*S25/L41","v":1.0862132584638516E-2},{"$f":"T19+T16+T14+0.5*T24+0.5*T25","v":9.9999989520039703E-2},null,null,null,null,null,null,null,"Kw","Kw",null,null,null,null,null,null,null,null,null,null,null,null,"9. Open the CurTiPot file and click on the Regression lower tab"]
[null,null,null,null,null,null,null,null,null,null,null,null,null,null,null,null,"Action","Parameter","Titrand","Titrant",null,null,null,null,null,null,null,{"$f":"AC9/S23^2","v":1.2467123723523007E-14},{"$f":"AC9/T23^2","v":1.6483050398991624E-14}]
[null,null,null,null,null,null,null,null,null,null,null,null,null,null,null,null,null,"I",{"$f":"AT41","v":1.086213258459855E-2},9.9999932445251433E-2,null,null,null,null,null,null,null,null,null,null,null,null,null,null,null,null,null,null,null,null,null,"10. Click on the upper Data tab and click on Solver in the Analysis group (at the right)"]
[null,null,null,null,null,null,null,null,null,null,null,null,null,"     CHreg - CHcalc residuals",null,null,null,"g H+",{"$f":"AU41","v":0.89870439443519512},0.78159398185987139]
[null,null,null,null,null,null,null,null,null,null,null,null,null,"Mean",{"$f":"AVERAGE(H41:H201)","v":-1.2497094599751357E-6},null,null,"[H+]",{"$f":"D41","v":1.3096149588076179E-3},1.65124464582979E-13,null,null,null,null,null,null,null,null,null,null,null,null,null,null,null,null,null,null,null,null,null,"To learn from the authors' of Excel Solver about the design, uses and limitations"]
[null,null,null,null,null,null,null,null,null,null,null,null,null,"Median",{"$f":"MEDIAN(H41:H201)","v":-1.1110042015941013E-5},null,null,"[OH-]",{"$f":"AB21/D41","v":9.5196864083425799E-12},9.9821976353531169E-2,null,null,null,null,null,null,null,null,null,null,null,null,null,null,null,null,null,null,null,null,null,"of the generalized reduced gradient method of nonlinear optimization, visit"]
[null,null,null,null,null,null,null,null,null,null,null,null,null,"Std. Deviation",{"$f":"STDEV(H42:H201)","v":3.4202921111863396E-4},null,null,"pH",{"$f":"IF(C41=\"\",B41,C41)","v":2.8861632347106934},12.889207370986353,null,null,null,null,null,null,null,null,null,null,null,null,null,null,null,null,null,null,null,null,null,"https://www.solver.com/excel-solver-online-help"]
[null,null,null,null,null,null,null,null,null,null,null,null,null,"RSD, %",{"$f":"100*O26/I17","v":0.31475068474555723},null,null,null,null,null,null,null,null,null,null,null,null,null,null,null,null,null,null,null,null,null,null,null,null,null,null,"https://faculty.insead.edu/delquie/msp/Download%20Solutions/Design%20and%20Use%20of%20Solver.pdf"]
[]
[null,null,null,null,null,null,null,null,null,null,null,null,null,null,null,null,null,"Color  coding"]
[null,null,null,null,null,null,null,null,null,null,null,null,null,null,null,null,null,"D  o     n  o  t     c  h  a  n  g  e "]
[null,null,null,null,null,null,null,null,null,null,null,null,null,"     pHreg - pH residuals",null,null,null," C h a n g e   c r i t e r i o u s l y"]
[null,null,null,null,null,null,null,null,null,null,null,null,null,"Mean",{"$f":"AVERAGE(F41:F201)","v":-3.1809539040105711E-3},null,null,"Fill out, change or leave blank"]
[null,null,null,null,null,null,null,null,null,null,null,null,null,"Median",{"$f":"MEDIAN(F41:F201)","v":1.2768326071093128E-3}]
[null,null,null,null,null,null,null,null,null,null,null,null,null,"Std. Deviation",{"$f":"STDEV(F41:F201)","v":2.3430292690702282E-2}]
[null,null,null,null,null,null,null,null,null,null,null,null,null,null,null,null,null,null," "]
[]
[]
["    Spreadsheet for 160 data pairs; it can be expanded or shortened (to gain speed).",null,null,null,null,null,"To modify the axis of a plot or copy a figure, see instructions in cells  R43, 44 and 45 of Evaluation"]
["Vol. added","simulated or","calculated pH","[H]","dpH/dV","pHreg-pH","Weighting","CHReg-CHcalc","CHReg","CHcalc","Dill. Titrant","Dil Titrand","den1","den2","den3","den4","den5","den6","den7","den1 titrant","den2 titrant","den3 titrant","h1","h2","h3","h4","h5","h6","h7","h1 titrant","h2 titrant","h3 titrant","I1","I2","I3","I4","I5","I6","I7","I1 titrant","I2 titrant","I3 titrant","Ipartial","Itotal","Click C22","I total","g H+",null,"pHReg- pH","Reject "]
["(mL)","measured pH","from regression","mol/L","for data weighting","for data weighting","factors","mol/L","mol/L","mol/L",null,null,{"$f":"K3","v":"Citric acid"},"Glycine","Ascorbic acid ","Acetic acid","Ammonia","Carbonic acid","HCl","Strong ACID","Strong BASE","Carbonic ac.",{"$f":"K3","v":"Citric acid"},"Glycine","Ascorbic acid ","Acetic acid","Ammonia","Carbonic acid","HCl","Strong ACID","Strong BASE","Carbonic ac.",{"$f":"K3","v":"Citric acid"},"Glycine","Ascorbic acid ","Acetic acid","Ammonia","Carbonic acid","HCl",{"$f":"R3","v":"Strong ACID"},{"$f":"S3","v":"Strong BASE"},{"$f":"T3","v":"Carbonic ac."},"mol/L","mol/L","to update AT -->","applied\nmol/L","applied",null,null,"with X"]
[0,2.9292395076433086,2.8861632347106934,{"$f":"IF(A41=\"\",\"\",10^-((((B41-P$12)/P$13)+7))/$AU41)","v":1.3096149588076179E-3},{"$f":"IF(A42=\"\",\"0\",(B42-B41)/(A42-A41))","v":0.1082286251696329},{"$f":"IF(A41=\"\",\"\",IF(C41=\"\",\"0,00001\",(IF(ABS(C41-B41)<0.00001,0.00001,C41-B41))))","v":-4.3076272932615289E-2},{"$f":"IF(A41=\"\",\"\",IF(AX41=\"X\",0,IF(ABS(E41)<0.00001,(0.00001^K$20)*(ABS(H41)^I$20)*ABS(F41)^M$20,((ABS(E41))^K$20)*((ABS(H41))^I$20)*ABS(F41)^N$20)))","v":1.9667397108049748E-6},{"$f":"IF(A41=\"\",\"\",I41-J41)","v":1.4024049738948358E-3},{"$f":"IF(A41=\"\",\"\",L41*I$18+K41*E$19)","v":0.11006911411707862},{"$f":"IF(A41=\"\",\"\",D41 -$AC$9/AU41^2/D41+L41*(W41*$B$11+X41*$C$11+Y41*$D$11+Z41*$E$11+AA41*$F$11+AB41*$G$11+AC41*$H$11)+K41*(AD41*$B$18+AE41*$C$18+AF41*$D$18))","v":0.10866670914318378},{"$f":"IF(A41=\"\",\"\",A41/(A41+$G$16))","v":0},{"$f":"IF(A41=\"\",\"\",$E$16/(A41+$G$16))","v":1},{"$f":"IF($A41=\"\",\"\",(1+(V$5*$AU41^(-2*V$4))*$D41+(V$6*$AU41^(-4*V$4-2))*$D41^2+(V$7*$AU41^(-6*V$4-6))*$D41^3+(V$8*$AU41^(-8*V$4-12))*$D41^4+(V$9*$AU41^(-10*V$4-20))*$D41^5+(V$10*$AU41^(-12*V$4-30))*$D41^6))","v":206515.25485022127},8204242.6240433557,7541124306.778614,61.44736272330028,2296909.1411729818,43368157156.484032,1.0000000001057738,{"$f":"IF($A41=\"\",\"\",(1+(AC$5*$AU41^(-2*AC$4))*$D41+(AC$6*$AU41^(-4*AC$4-2))*$D41^2))","v":1.0000000001057738},{"$f":"IF($A41=\"\",\"\",(1+(AD$5*$AU41^(-2*AD$4))*$D41+(AD$6*$AU41^(-4*AD$4-2))*$D41^2))","v":5880000427373.9463},{"$f":"IF($A41=\"\",\"\",(1+(AE$5*$AU41^(-2*AE$4))*$D41+(AE$6*$AU41^(-4*AE$4-2))*$D41^2))","v":43368157156.484032},{"$f":"IF($A41=\"\",\"\",((V$5*$AU41^(-2*V$4))*$D41+2*(V$6*$AU41^(-4*V$4-2))*$D41^2+3*(V$7*$AU41^(-6*V$4-6))*$D41^3+4*(V$8*$AU41^(-8*V$4-12))*$D41^4+5*(V$9*$AU41^(-10*V$4-20))*$D41^5+6*(V$10*$AU41^(-12*V$4-30))*$D41^6)/M41)","v":2.5736186420185359},1.2267160445460585,1.9301486200626616,0.9837259085552128,0.99999956463232176,1.9995798153645994,1.0577389520733793E-10,{"$f":"IF($A41=\"\",\"\",((AC$5*$AU41^(-2*AC$4))*$D41+2*(AC$6*$AU41^(-4*AC$4-2))*$D41^2)/T41)","v":1.0577389453169581E-10},{"$f":"IF($A41=\"\",\"\",((AD$5*$AU41^(-2*AD$4))*$D41+2*(AD$6*$AU41^(-4*AD$4-2))*$D41^2)/U41)","v":0.99999999999982991},{"$f":"IF($A41=\"\",\"\",((AE$5*$AU41^(-2*AE$4))*$D41+2*(AE$6*$AU41^(-4*AE$4-2))*$D41^2)/V41)","v":1.9995798153645994},{"$f":"IF(B$11=0,\"\",IF($A41=\"\",\"\",0.5*B$11*$L41*(1*V$4^2+(V$5*$AU41^(-2*V$4))*$D41*(V$4+1)^2+(V$6*$AU41^(-4*V$4-2))*$D41^2*(V$4+2)^2+(V$7*$AU41^(-6*V$4-6))*$D41^3*(V$4+3)^2+(V$8*$AU41^(-8*V$4-12))*$D41^4*(V$4+4)^2+(V$9*$AU41^(-10*V$4-20))*$D41^5*(V$4+5)^2+(V$10*$AU41^(-12*V$4-30))*$D41^6*(V$4+6)^2)/M41))","v":5.5351363017026815E-3},3.9781680316075983E-3,"","","","","",{"$f":"IF(B$18=0,\"\",IF($A41=\"\",\"\",0.5*B$18*$K41*(1*AC$4^2+(AC$5*$AU41^(-2*AC$4))*$D41*(AC$4+1)^2+(AC$6*$AU41^(-4*AC$4-2))*$D41^2*(AC$4+2)^2)/T41))","v":""},{"$f":"IF(C$18=0,\"\",IF($A41=\"\",\"\",0.5*C$18*$K41*(1*AD$4^2+(AD$5*$AU41^(-2*AD$4))*$D41*(AD$4+1)^2+(AD$6*$AU41^(-4*AD$4-2))*$D41^2*(AD$4+2)^2)/U41))","v":0},{"$f":"IF(D$18=0,\"\",IF($A41=\"\",\"\",0.5*D$18*$K41*(1*AE$4^2+(AE$5*$AU41^(-2*AE$4))*$D41*(AE$4+1)^2+(AE$6*$AU41^(-4*AE$4-2))*$D41^2*(AE$4+2)^2)/V41))","v":""},{"$f":"IF(A41=\"\",\"\",SUM(AG41:AP41)+0.5*(D41+ $AC$9/AU41^2/D41)+$L41*$S$16+$K41*$T$16)","v":1.0862132584638516E-2},{"$f":"IF(A41=\"\",\"\",AQ41+$L41*S$14+$K41*$T$14)","v":1.0862132584638516E-2},null,1.086213258459855E-2,{"$f":"IF(A41=\"\",\"\",10^(-$P$16*($AT41^0.5/(1+$AT41^0.5)-$P$17*$AT41)))","v":0.89870439443519512},null,{"$f":"IF(C41=\"\",\"\",C41-B41)","v":-4.3076272932615289E-2}]
[0.87795368308434263,3.0242592277261426,3.025536060333252,{"$f":"IF(A42=\"\",\"\",10^-((((B42-P$12)/P$13)+7))/$AU42)","v":1.0598621293646361E-3},{"$f":"IF(A42=\"\",\"\",IF(A43=\"\",(B42-B41)/(A42-A41),((B43-B42)/(A43-A42)+(B42-B41)/(A42-A41))/2))","v":0.11590039089020304},{"$f":"IF(A42=\"\",\"\",IF(C42=\"\",\"0,00001\",(IF(ABS(C42-B42)<0.00001,0.00001,C42-B42))))","v":1.2768326071093128E-3},{"$f":"IF(A42=\"\",\"\",IF(AX42=\"X\",0,IF(ABS(E42)<0.00001,(0.00001^M$20)*(ABS(H42)^I$20)*ABS(F42)^K$20,((ABS(E42))^M$20)*((ABS(H42))^I$20)*ABS(F42)^K$20)))","v":1.4206361188775013E-9},{"$f":"IF(A42=\"\",\"\",I42-J42)","v":-3.7691326838909522E-5},{"$f":"IF(A42=\"\",\"\",L42*I$18+K42*E$19)","v":0.10544051949522083},{"$f":"IF(A42=\"\",\"\",D42 -$AC$9/AU42^2/D42+L42*(W42*$B$11+X42*$C$11+Y42*$D$11+Z42*$E$11+AA42*$F$11+AB42*$G$11+AC42*$H$11)+K42*(AD42*$B$18+AE42*$C$18+AF42*$D$18))","v":0.10547821082205974},{"$f":"IF(A42=\"\",\"\",A42/(A42+$G$16))","v":4.2051711408655677E-2},{"$f":"IF(A42=\"\",\"\",$E$16/(A42+$G$16))","v":0.95794828859134429},{"$f":"IF($A42=\"\",\"\",(1+(V$5*$AU42^(-2*V$4))*$D42+(V$6*$AU42^(-4*V$4-2))*$D42^2+(V$7*$AU42^(-6*V$4-6))*$D42^3+(V$8*$AU42^(-8*V$4-12))*$D42^4+(V$9*$AU42^(-10*V$4-20))*$D42^5+(V$10*$AU42^(-12*V$4-30))*$D42^6))","v":111335.12485381369},{"$f":"IF($A42=\"\",\"\",(1+(W$5*$AU42^(-2*W$4))*$D42+(W$6*$AU42^(-4*W$4-2))*$D42^2+(W$7*$AU42^(-6*W$4-6))*$D42^3+(W$8*$AU42^(-8*W$4-12))*$D42^4+(W$9*$AU42^(-10*W$4-20))*$D42^5+(W$10*$AU42^(-12*W$4-30))*$D42^6))","v":6261782.481438309},{"$f":"IF($A42=\"\",\"\",(1+(X$5*$AU42^(-2*X$4))*$D42+(X$6*$AU42^(-4*X$4-2))*$D42^2+(X$7*$AU42^(-6*X$4-6))*$D42^3+(X$8*$AU42^(-8*X$4-12))*$D42^4+(X$9*$AU42^(-10*X$4-20))*$D42^5+(X$10*$AU42^(-12*X$4-30))*$D42^6))","v":4814148516.4095383},{"$f":"IF($A42=\"\",\"\",(1+(Y$5*$AU42^(-2*Y$4))*$D42+(Y$6*$AU42^(-4*Y$4-2))*$D42^2+(Y$7*$AU42^(-6*Y$4-6))*$D42^3+(Y$8*$AU42^(-8*Y$4-12))*$D42^4+(Y$9*$AU42^(-10*Y$4-20))*$D42^5+(Y$10*$AU42^(-12*Y$4-30))*$D42^6))","v":49.220551174653281},{"$f":"IF($A42=\"\",\"\",(1+(Z$5*$AU42^(-2*Z$4))*$D42+(Z$6*$AU42^(-4*Z$4-2))*$D42^2+(Z$7*$AU42^(-6*Z$4-6))*$D42^3+(Z$8*$AU42^(-8*Z$4-12))*$D42^4+(Z$9*$AU42^(-10*Z$4-20))*$D42^5+(Z$10*$AU42^(-12*Z$4-30))*$D42^6))","v":1858872.5233331253},{"$f":"IF($A42=\"\",\"\",(1+(AA$5*$AU42^(-2*AA$4))*$D42+(AA$6*$AU42^(-4*AA$4-2))*$D42^2+(AA$7*$AU42^(-6*AA$4-6))*$D42^3+(AA$8*$AU42^(-8*AA$4-12))*$D42^4+(AA$9*$AU42^(-10*AA$4-20))*$D42^5+(AA$10*$AU42^(-12*AA$4-30))*$D42^6))","v":27206703680.20718},{"$f":"IF($A42=\"\",\"\",(1+(AB$5*$AU42^(-2*AB$4))*$D42+(AB$6*$AU42^(-4*AB$4-2))*$D42^2+(AB$7*$AU42^(-6*AB$4-6))*$D42^3+(AB$8*$AU42^(-8*AB$4-12))*$D42^4+(AB$9*$AU42^(-10*AB$4-20))*$D42^5+(AB$10*$AU42^(-12*AB$4-30))*$D42^6))","v":1.0000000000843785},{"$f":"IF($A42=\"\",\"\",(1+(AC$5*$AU42^(-2*AC$4))*$D42+(AC$6*$AU42^(-4*AC$4-2))*$D42^2))","v":1.0000000000843785},{"$f":"IF($A42=\"\",\"\",(1+(AD$5*$AU42^(-2*AD$4))*$D42+(AD$6*$AU42^(-4*AD$4-2))*$D42^2))","v":4690640728414.8975},{"$f":"IF($A42=\"\",\"\",(1+(AE$5*$AU42^(-2*AE$4))*$D42+(AE$6*$AU42^(-4*AE$4-2))*$D42^2))","v":27206703680.20718},{"$f":"IF($A42=\"\",\"\",((V$5*$AU42^(-2*V$4))*$D42+2*(V$6*$AU42^(-4*V$4-2))*$D42^2+3*(V$7*$AU42^(-6*V$4-6))*$D42^3+4*(V$8*$AU42^(-8*V$4-12))*$D42^4+5*(V$9*$AU42^(-10*V$4-20))*$D42^5+6*(V$10*$AU42^(-12*V$4-30))*$D42^6)/M42)","v":2.5128494005908633},{"$f":"IF($A42=\"\",\"\",((W$5*$AU42^(-2*W$4))*$D42+2*(W$6*$AU42^(-4*W$4-2))*$D42^2+3*(W$7*$AU42^(-6*W$4-6))*$D42^3+4*(W$8*$AU42^(-8*W$4-12))*$D42^4+5*(W$9*$AU42^(-10*W$4-20))*$D42^5+6*(W$10*$AU42^(-12*W$4-30))*$D42^6)/N42)","v":1.1917711204306385},{"$f":"IF($A42=\"\",\"\",((X$5*$AU42^(-2*X$4))*$D42+2*(X$6*$AU42^(-4*X$4-2))*$D42^2+3*(X$7*$AU42^(-6*X$4-6))*$D42^3+4*(X$8*$AU42^(-8*X$4-12))*$D42^4+5*(X$9*$AU42^(-10*X$4-20))*$D42^5+6*(X$10*$AU42^(-12*X$4-30))*$D42^6)/O42)","v":1.9139609742719299},{"$f":"IF($A42=\"\",\"\",((Y$5*$AU42^(-2*Y$4))*$D42+2*(Y$6*$AU42^(-4*Y$4-2))*$D42^2+3*(Y$7*$AU42^(-6*Y$4-6))*$D42^3+4*(Y$8*$AU42^(-8*Y$4-12))*$D42^4+5*(Y$9*$AU42^(-10*Y$4-20))*$D42^5+6*(Y$10*$AU42^(-12*Y$4-30))*$D42^6)/P42)","v":0.97968328317877584},{"$f":"IF($A42=\"\",\"\",((Z$5*$AU42^(-2*Z$4))*$D42+2*(Z$6*$AU42^(-4*Z$4-2))*$D42^2+3*(Z$7*$AU42^(-6*Z$4-6))*$D42^3+4*(Z$8*$AU42^(-8*Z$4-12))*$D42^4+5*(Z$9*$AU42^(-10*Z$4-20))*$D42^5+6*(Z$10*$AU42^(-12*Z$4-30))*$D42^6)/Q42)","v":0.99999946203949575},{"$f":"IF($A42=\"\",\"\",((AA$5*$AU42^(-2*AA$4))*$D42+2*(AA$6*$AU42^(-4*AA$4-2))*$D42^2+3*(AA$7*$AU42^(-6*AA$4-6))*$D42^3+4*(AA$8*$AU42^(-8*AA$4-12))*$D42^4+5*(AA$9*$AU42^(-10*AA$4-20))*$D42^5+6*(AA$10*$AU42^(-12*AA$4-30))*$D42^6)/R42)","v":1.9994733293704534},{"$f":"IF($A42=\"\",\"\",((AB$5*$AU42^(-2*AB$4))*$D42+2*(AB$6*$AU42^(-4*AB$4-2))*$D42^2+3*(AB$7*$AU42^(-6*AB$4-6))*$D42^3+4*(AB$8*$AU42^(-8*AB$4-12))*$D42^4+5*(AB$9*$AU42^(-10*AB$4-20))*$D42^5+6*(AB$10*$AU42^(-12*AB$4-30))*$D42^6)/S42)","v":8.4378751006772457E-11},{"$f":"IF($A42=\"\",\"\",((AC$5*$AU42^(-2*AC$4))*$D42+2*(AC$6*$AU42^(-4*AC$4-2))*$D42^2)/T42)","v":8.4378750648808625E-11},{"$f":"IF($A42=\"\",\"\",((AD$5*$AU42^(-2*AD$4))*$D42+2*(AD$6*$AU42^(-4*AD$4-2))*$D42^2)/U42)","v":0.99999999999978684},{"$f":"IF($A42=\"\",\"\",((AE$5*$AU42^(-2*AE$4))*$D42+2*(AE$6*$AU42^(-4*AE$4-2))*$D42^2)/V42)","v":1.9994733293704534},{"$f":"IF(B$11=0,\"\",IF($A42=\"\",\"\",0.5*B$11*$L42*(1*V$4^2+(V$5*$AU42^(-2*V$4))*$D42*(V$4+1)^2+(V$6*$AU42^(-4*V$4-2))*$D42^2*(V$4+2)^2+(V$7*$AU42^(-6*V$4-6))*$D42^3*(V$4+3)^2+(V$8*$AU42^(-8*V$4-12))*$D42^4*(V$4+4)^2+(V$9*$AU42^(-10*V$4-20))*$D42^5*(V$4+5)^2+(V$10*$AU42^(-12*V$4-30))*$D42^6*(V$4+6)^2)/M42))","v":6.1170896189200706E-3},{"$f":"IF(C$11=0,\"\",IF($A42=\"\",\"\",0.5*C$11*$L42*(1*W$4^2+(W$5*$AU42^(-2*W$4))*$D42*(W$4+1)^2+(W$6*$AU42^(-4*W$4-2))*$D42^2*(W$4+2)^2+(W$7*$AU42^(-6*W$4-6))*$D42^3*(W$4+3)^2+(W$8*$AU42^(-8*W$4-12))*$D42^4*(W$4+4)^2+(W$9*$AU42^(-10*W$4-20))*$D42^5*(W$4+5)^2+(W$10*$AU42^(-12*W$4-30))*$D42^6*(W$4+6)^2)/N42))","v":3.223490502829694E-3},{"$f":"IF(D$11=0,\"\",IF($A42=\"\",\"\",0.5*D$11*$L42*(1*X$4^2+(X$5*$AU42^(-2*X$4))*$D42*(X$4+1)^2+(X$6*$AU42^(-4*X$4-2))*$D42^2*(X$4+2)^2+(X$7*$AU42^(-6*X$4-6))*$D42^3*(X$4+3)^2+(X$8*$AU42^(-8*X$4-12))*$D42^4*(X$4+4)^2+(X$9*$AU42^(-10*X$4-20))*$D42^5*(X$4+5)^2+(X$10*$AU42^(-12*X$4-30))*$D42^6*(X$4+6)^2)/O42))","v":""},{"$f":"IF(E$11=0,\"\",IF($A42=\"\",\"\",0.5*E$11*$L42*(1*Y$4^2+(Y$5*$AU42^(-2*Y$4))*$D42*(Y$4+1)^2+(Y$6*$AU42^(-4*Y$4-2))*$D42^2*(Y$4+2)^2+(Y$7*$AU42^(-6*Y$4-6))*$D42^3*(Y$4+3)^2+(Y$8*$AU42^(-8*Y$4-12))*$D42^4*(Y$4+4)^2+(Y$9*$AU42^(-10*Y$4-20))*$D42^5*(Y$4+5)^2+(Y$10*$AU42^(-12*Y$4-30))*$D42^6*(Y$4+6)^2)/P42))","v":""},{"$f":"IF(F$11=0,\"\",IF($A42=\"\",\"\",0.5*F$11*$L42*(1*Z$4^2+(Z$5*$AU42^(-2*Z$4))*$D42*(Z$4+1)^2+(Z$6*$AU42^(-4*Z$4-2))*$D42^2*(Z$4+2)^2+(Z$7*$AU42^(-6*Z$4-6))*$D42^3*(Z$4+3)^2+(Z$8*$AU42^(-8*Z$4-12))*$D42^4*(Z$4+4)^2+(Z$9*$AU42^(-10*Z$4-20))*$D42^5*(Z$4+5)^2+(Z$10*$AU42^(-12*Z$4-30))*$D42^6*(Z$4+6)^2)/Q42))","v":""},{"$f":"IF(G$11=0,\"\",IF($A42=\"\",\"\",0.5*G$11*$L42*(1*AA$4^2+(AA$5*$AU42^(-2*AA$4))*$D42*(AA$4+1)^2+(AA$6*$AU42^(-4*AA$4-2))*$D42^2*(AA$4+2)^2+(AA$7*$AU42^(-6*AA$4-6))*$D42^3*(AA$4+3)^2+(AA$8*$AU42^(-8*AA$4-12))*$D42^4*(AA$4+4)^2+(AA$9*$AU42^(-10*AA$4-20))*$D42^5*(AA$4+5)^2+(AA$10*$AU42^(-12*AA$4-30))*$D42^6*(AA$4+6)^2)/R42))","v":""},{"$f":"IF(H$11=0,\"\",IF($A42=\"\",\"\",0.5*H$11*$L42*(1*AB$4^2+(AB$5*$AU42^(-2*AB$4))*$D42*(AB$4+1)^2+(AB$6*$AU42^(-4*AB$4-2))*$D42^2*(AB$4+2)^2+(AB$7*$AU42^(-6*AB$4-6))*$D42^3*(AB$4+3)^2+(AB$8*$AU42^(-8*AB$4-12))*$D42^4*(AB$4+4)^2+(AB$9*$AU42^(-10*AB$4-20))*$D42^5*(AB$4+5)^2+(AB$10*$AU42^(-12*AB$4-30))*$D42^6*(AB$4+6)^2)/S42))","v":""},{"$f":"IF(B$18=0,\"\",IF($A42=\"\",\"\",0.5*B$18*$K42*(1*AC$4^2+(AC$5*$AU42^(-2*AC$4))*$D42*(AC$4+1)^2+(AC$6*$AU42^(-4*AC$4-2))*$D42^2*(AC$4+2)^2)/T42))","v":""},{"$f":"IF(C$18=0,\"\",IF($A42=\"\",\"\",0.5*C$18*$K42*(1*AD$4^2+(AD$5*$AU42^(-2*AD$4))*$D42*(AD$4+1)^2+(AD$6*$AU42^(-4*AD$4-2))*$D42^2*(AD$4+2)^2)/U42))","v":4.482512501321559E-16},{"$f":"IF(D$18=0,\"\",IF($A42=\"\",\"\",0.5*D$18*$K42*(1*AE$4^2+(AE$5*$AU42^(-2*AE$4))*$D42*(AE$4+1)^2+(AE$6*$AU42^(-4*AE$4-2))*$D42^2*(AE$4+2)^2)/V42))","v":""},{"$f":"IF(A42=\"\",\"\",SUM(AG42:AP42)+0.5*(D42+ $AC$9/AU42^2/D42)+$L42*$S$16+$K42*$T$16)","v":1.2637932548630625E-2},{"$f":"IF(A42=\"\",\"\",AQ42+$L42*S$14+$K42*$T$14)","v":1.2637932548630625E-2},null,1.2637932548611029E-2,{"$f":"IF(A42=\"\",\"\",10^(-$P$16*($AT42^0.5/(1+$AT42^0.5)-$P$17*$AT42)))","v":0.89225994637186012},null,{"$f":"IF(C42=\"\",\"\",C42-B42)","v":1.2768326071093128E-3}]
[1.6979725172859617,3.1255907235298888,3.1648154258728027,8.4456191371001723E-4,{"$f":"IF(A43=\"\",\"\",IF(A44=\"\",(B43-B42)/(A43-A42),((B44-B43)/(A44-A43)+(B43-B42)/(A43-A42))/2))","v":0.17315044192717757},3.9224702342913975E-2,1.0800128541984129E-6,-1.0392366690020194E-3,0.10145566737112482,0.10249490404012684,7.8254892982892788E-2,0.92174510701710721,59216.631685336994,4735828.6907727299,3013015132.8312044,38.947839958487165,1481261.6730541629,16642570024.295168,1.0000000000664029,1.0000000000664029,3691365596796.0913,16642570024.295168,2.4459303015401672,1.1590091045788686,1.8931581700676587,0.9743246351770507,0.9999993248998349,1.999330851801524,6.640301443118584E-11,6.6403014250131966E-11,0.99999999999972911,1.999330851801524,6.7790863643717785E-3,2.5717833863127134E-3,"","","","","",{"$f":"IF(B$18=0,\"\",IF($A43=\"\",\"\",0.5*B$18*$K43*(1*AC$4^2+(AC$5*$AU43^(-2*AC$4))*$D43*(AC$4+1)^2+(AC$6*$AU43^(-4*AC$4-2))*$D43^2*(AC$4+2)^2)/T43))","v":""},1.059972128618388E-15,"",1.4325605200508854E-2,1.4325605200508854E-2,null,1.4325605200498311E-2,0.88670219560998553,null,3.9224702342913975E-2]
[2.4511264302418567,3.2933397359810788,3.3038496971130371,5.7771648607525669E-4,0.22713069347543746,1.0509961131958345E-2,5.8671760066418355E-8,-2.422225424406621E-4,9.8052197477997885E-2,9.8294420020438547E-2,0.10917610026640662,0.89082389973359333,22277.843518944119,3036886.4111997117,1425418316.7439413,26.621571696474778,1013246.6805199299,7490883283.5890942,1.0000000000448339,1.0000000000448339,2492331273655.8262,7490883283.5890942,2.3341769982822069,1.1145224765392305,1.8494937822905855,0.96243647777819141,0.99999901307350003,1.9990092505047667,4.4833874248821236E-11,4.4833874190902179E-11,0.99999999999959877,1.9990092505047667,8.0847355498345763E-3,1.7901337838524974E-3,"","","","","","",2.1902405474827561E-15,"",1.6240782315488866E-2,1.6240782315488866E-2,null,1.6240782315480051E-2,0.88093832243447023,null,1.0509961131958345E-2]
[3.1349450364359654,3.4516660766305347,3.442634105682373,4.0372692347776261E-4,0.22572427870847189,-9.0319709481616606E-3,3.2725149829353095E-8,1.8090093927161655E-4,9.5153987998438938E-2,9.4973087059167322E-2,0.13550691525303563,0.8644930847469644,9214.3715597482642,2023762.2959156516,715950637.9420706,18.683984859975958,708089.7791562085,3525950989.1333919,1.0000000000309444,1.0000000000309444,1720204717786.5466,3525950989.1333919,2.2297758701824342,1.0828906904902771,1.7957371053677169,0.94647822680791405,0.99999858774970429,1.9985651831874551,3.0944287353783401E-11,3.0944287334023601E-11,0.99999999999941869,1.9985651831874551,9.3865233997399225E-3,1.2573982714328847E-3,"","","","","","",3.9386857230399174E-15,"",1.8221106355657327E-2,1.8221106355657327E-2,null,1.8221106355645483E-2,0.87547996331512723,null,-9.0319709481616606E-3]
[3.7547393163549714,3.5879686920942295,3.5813689231872559,2.9661056032745945E-4,0.19737749587873965,-6.5997689069736687E-3,1.3627481211246146E-8,1.167368031567001E-4,9.2671287738608693E-2,9.2554550935451993E-2,0.15806274555788788,0.84193725444211209,4437.8482242276559,1438128.1878525598,402559764.02148479,13.849197558287415,520220.47839869047,1842041433.0675967,1.0000000000224842,1.0000000000224842,1249902125259.582,1842041433.0675967,2.1421342316834466,1.0622673190422776,1.7389431777908537,0.92779365044138629,0.99999807773811,1.9980263676819678,2.248413914423995E-11,2.2484139136406013E-11,0.99999999999919997,1.9980263676819678,1.0562204272143619E-2,9.1991985782800953E-4,"","","","","","",6.3230049122870769E-15,"",2.0117887821401795E-2,2.0117887821401795E-2,null,2.0117887821380666E-2,0.87065219368819347,null,-6.5997689069736687E-3]
[4.3231222967733629,3.6873442574627857,3.720573902130127,2.369900162740523E-4,0.24702101495004952,3.322964466734124E-2,2.8580776188643694E-7,-5.3460991562674642E-4,9.0505744101512881E-2,9.1040354017139627E-2,0.17773714427061266,0.82226285572938729,2643.5427997194329,1124690.5938147313,267428917.70538679,11.176101597439558,415653.1686742219,1145769702.8367801,1.0000000000178066,1.0000000000178066,989877457779.16528,1145769702.8367801,2.0792256875287873,1.050381461041286,1.691521811709352,0.91052336172130899,0.99999759414801725,1.9975092176019484,1.7806626127047186E-11,1.7806626123051839E-11,0.99999999999898981,1.9975092176019484,1.1426934774488222E-2,7.2693764333464227E-4,"","","","","","",8.9777347122023553E-15,"",2.1729891234364057E-2,2.1729891234364057E-2,null,2.1729891234328714E-2,0.86681355034937735,null,3.322964466734124E-2]
[4.8577314577414654,3.8579930711773232,3.8588471412658691,1.6099599435202654E-4,0.29863770306023651,8.5407008854598843E-4,1.6011217547473575E-10,-1.265354398873042E-5,8.8559259161840931E-2,8.8571912705829661E-2,0.19542135073748323,0.80457864926251677,1135.5268269808921,742295.70698465535,136831904.10916075,7.826510882719119,282368.73536864563,509794125.03865761,1.0000000000119453,1.0000000000119453,664046950925.82507,509794125.03865761,1.9722855794371998,1.0347872493867636,1.6006118744385445,0.87222914335837787,0.99999645853143515,1.9962915866464461,1.19453513104021E-11,1.1945351309149721E-11,0.99999999999849409,1.9962915866464461,1.3281380556171569E-2,4.9115959231163075E-4,"","","","","","",1.4714422712507273E-14,"",2.4182498992080817E-2,2.4182498992080817E-2,null,2.4182498991955511E-2,0.86137419705066509,null,8.5407008854598843E-4]
[5.3776574277435429,4.0025701700123921,3.9975075721740723,1.1607844027245345E-4,0.2576760924357373,-5.06259783831986E-3,5.2014069815655956E-9,7.2120780511344962E-5,8.6744897105237209E-2,8.6672776324725864E-2,0.21190519428576343,0.78809480571423651,572.37603790745834,523902.73653092672,79764479.583477065,5.8652828768737963,203588.71307805952,256350988.66824231,1.0000000000085134,1.0000000000085134,473269041137.8584,256350988.66824231,1.8793552622133614,1.025326563383341,1.5173246560610765,0.8295052393904313,0.99999508813634663,1.9948044648947718,8.5135011081841313E-12,8.5135011077147758E-12,0.99999999999788702,1.9948044648947718,1.5058460830975407E-2,3.5028422993110359E-4,"","","","","","",2.2387392356817785E-14,"",2.6608997105754366E-2,2.6608997105754366E-2,null,2.6608997105407484E-2,0.85640316977564213,null,-5.06259783831986E-3]
[5.8992317426600493,4.126329174600178,4.1369204521179199,8.7755099352263574E-5,0.27261102838781448,1.0591277517741915E-2,2.2159947460310146E-8,-1.4886217605661334E-4,8.4997976164503539E-2,8.5146838340560152E-2,0.22777632175641335,0.77222367824358662,326.13467034353033,389511.05583892949,51353996.387249008,4.6397310077977689,153912.95769112161,142218755.29157123,1.0000000000063689,1.0000000000063689,354053823314.02094,142218755.29157123,1.7962237263667566,1.0192647771351255,1.4450012574769584,0.78447026383224616,0.99999350282123745,1.9930671752444611,6.3689723694610397E-12,6.3689723692582553E-12,0.99999999999717559,1.9930671752444611,1.6731206254460632E-2,2.61109841136064E-4,"","","","","","",3.2166906096985108E-14,"",2.8960947888210506E-2,2.8960947888210506E-2,null,2.8960947887495821E-2,0.85191931172086932,null,1.0591277517741915E-2]
[6.4320653895265423,4.2904112158044843,4.2750144004821777,6.0552287799569982E-5,0.26303553612373054,-1.5396815322306523E-2,4.688709877605285E-8,2.1653429006984748E-4,8.328453527562206E-2,8.3068000985552212E-2,0.24334327623429639,0.75665672376570359,161.13339385989275,263570.25406864652,29588404.353117697,3.4776902509002134,106202.47691357654,65229142.696007952,1.0000000000043356,1.0000000000043356,241016631295.24307,65229142.696007952,1.6800569821135583,1.0133708173682163,1.353092825250553,0.7124528270621151,0.99999058402375296,1.9898486661988615,4.3355786060814941E-12,4.3355786060148777E-12,0.99999999999585087,1.9898486661988615,1.9320734175881565E-2,1.7762481981742771E-4,"","","","","","",5.0482673109849255E-14,"",3.2220933272262442E-2,3.2220933272262442E-2,null,3.222093327072087E-2,0.84617117672426978,null,-1.5396815322306523E-2]
[6.9767121531185694,4.4092143226863287,4.4148745536804199,4.6294698344884552E-5,0.22015720444589365,5.6602309940911866E-3,6.2407713832314693E-9,-7.899855304517589E-5,8.1603060812104472E-2,8.1682059365149648E-2,0.25861980931994505,0.7413801906800549,99.481415966218009,198847.52198735802,20263638.886826813,2.8751676240585136,81196.368765739055,37105175.899183922,1.0000000000032812,1.0000000000032812,182406410042.93634,37105175.899183922,1.5918712103079815,1.0102526988444398,1.2923287427818828,0.65219419152041447,0.99998768417830497,1.9866304684739589,3.2812561614034565E-12,3.2812561613736873E-12,0.99999999999451772,1.9866304684739589,2.1240933285301258E-2,1.3350742370107278E-4,"","","","","","",7.0891096770960231E-14,"",3.4843110571192229E-2,3.4843110571192229E-2,null,3.4843110569135499E-2,0.84188819279190141,null,5.6602309940911866E-3]
[7.5253937233355828,4.5311235098191993,4.5546164512634277,3.5139005475333345E-5,0.23631333186498227,2.3492941444228421E-2,1.0283876577828445E-7,-3.206848387097283E-4,7.9976413942274546E-2,8.0297098780984275E-2,0.27339822270936948,0.72660177729063047,62.381081049645218,149062.87735055597,13981423.197381012,2.4091704082772396,61630.616557298032,20838305.340314947,1.0000000000024658,1.0000000000024658,137076660249.03351,20838305.340314947,1.4994869523205954,1.0077984814354126,1.2368915479854414,0.58491935789835448,0.99998377429829755,1.9822875955848527,2.4658323459325008E-12,2.4658323459194833E-12,0.99999999999270484,1.9822875955848527,2.3290148363935722E-2,9.9598650258374711E-5,"","","","","","",9.972457098556177E-14,"",3.758150314695137E-2,3.758150314695137E-2,null,3.7581503144585492E-2,0.83769712416994047,null,2.3492941444228421E-2]
[8.0660327701480128,4.666521685185482,4.6936049461364746,2.5860496742139494E-5,0.30919147879390374,2.708326095099256E-2,1.2572585444701205E-7,-3.5457841790922928E-4,7.8435819567738749E-2,7.8790397985647978E-2,0.28739483190254517,0.71260516809745478,38.448675811120367,108350.48219624491,9430444.2257873844,2.0264073819732591,45357.221003980834,11013945.957404939,1.0000000000017961,1.0000000000017961,99843493128.866913,11013945.957404939,1.3969178416864148,1.0057468369068081,1.1844123648543037,0.50651581271569002,0.99997795279389112,1.9758418877886179,1.7960556514215507E-12,1.7960556514163619E-12,0.99999999998998435,1.9758418877886179,2.5646879306486882E-2,7.2089322095756202E-5,"","","","","","",1.4392266481081937E-13,"",4.0596202032023909E-2,4.0596202032023909E-2,null,4.0596202029547182E-2,0.83337688801985199,null,2.708326095099256E-2]
[8.5878766272799112,4.8585299434066762,4.8298306465148926,1.6730397544462851E-5,0.27436846030679235,-2.8699296891783632E-2,1.236077863129581E-7,3.5157899014724714E-4,7.7004050039900782E-2,7.6652471049753534E-2,0.30040274551503243,0.69959725448496757,20.575702243937837,69034.11180635108,5545268.1129586026,1.6552904707488656,29344.118041294671,4490734.894892144,1.0000000000011466,1.0000000000011466,63743198619.845848,4490734.894892144,1.2558150930629275,1.0037169536246338,1.1261456058166692,0.39587642309836252,0.99996592162018316,1.9626707548539066,1.1466578986953682E-12,1.1466578986939633E-12,0.9999999999843121,1.9626707548539066,2.9182933876408676E-2,4.5984085325014854E-5,"","","","","","",2.356351359982623E-13,"",4.4742954324700261E-2,4.4742954324700261E-2,null,4.4742954322004126E-2,0.8278731468044459,null,-2.8699296891783632E-2]
[9.0860306183458306,4.9485936682870735,4.970512866973877,1.3637151791659962E-5,0.31300348692797042,2.1919198686803476E-2,6.4484119044207647E-8,-2.5393723445805982E-4,7.5685208175262822E-2,7.5939145409720882E-2,0.31238468863519914,0.68761531136480092,15.704230731745499,55901.135490245855,4360109.8384216614,1.5309932359682752,23918.934628048843,2956949.3408988528,1.0000000000009293,1.0000000000009293,51652219614.248596,2956949.3408988528,1.192158571259317,1.0030257425211906,1.1047236838541212,0.3468292501190896,0.99995819211785342,1.9543314890704599,9.2915678098317832E-13,9.2915678098241758E-13,0.99999999998063971,1.9543314890704599,3.0558096033306958E-2,3.6938821494650975E-5,"","","","","","",3.0239231824708051E-13,"",4.6698306073604368E-2,4.6698306073604368E-2,null,4.6698306070862713E-2,0.82543457678194798,null,2.1919198686803476E-2]
[9.5631117394077592,5.160995920721752,5.1053652763366699,8.4161160650957028E-6,0.29902155328986063,-5.5630644385082029E-2,3.6826131258630634E-7,6.0684537782396131E-4,7.4463821729805257E-2,7.3856976351981296E-2,0.32348122970627913,0.67651877029372087,8.7854940181136829,34019.404541315605,2515240.9677136559,1.3235165051837334,14761.861867808557,1115360.2917771947,1.0000000000005662,1.0000000000005662,31469978227.350231,1115360.2917771947,1.0479593216202834,1.0018511401419228,1.0665266136746077,0.24443707646760485,0.99993225786767581,1.9271756388584891,5.6610429483983432E-13,5.661042948396555E-13,0.99999999996822364,1.9271756388584891,3.4536835077930809E-2,2.2672412178174837E-5,"","","","","","",5.1395210280944034E-13,"",5.1207294304219747E-2,5.1207294304219747E-2,null,5.1207294299680226E-2,0.82014825113528977,null,-5.5630644385082029E-2]
[10.027885822637472,5.2320278461258294,5.2468676567077637,7.1609640913619838E-6,0.25898328595919284,1.4839810581934287E-2,2.4806915752421992E-8,-1.5750211348557197E-4,7.3311264580671567E-2,7.3468766694157139E-2,0.33395244280160519,0.66604755719839481,7.3570605676116543,28819.308702959072,2101069.4157056529,1.2741402546043592,12560.475294228785,808060.65722797054,1.0000000000004796,1.0000000000004796,26666917160.190037,808060.65722797054,1.000787426944445,1.0015658197266819,1.0569512038796822,0.21515704696849419,0.999920385178381,1.9151712950404427,4.797034236083161E-13,4.7970342360820594E-13,0.99999999996250033,1.9151712950404427,3.5541965869259708E-2,1.9110902837486316E-5,"","","","","","",6.2615494846203914E-13,"",5.2724529531068112E-2,5.2724529531068112E-2,null,5.2724529525710259E-2,0.81846602802476798,null,1.4839810581934287E-2]
[10.491771616216283,5.4014090132506976,5.383450984954834,4.8721538082218674E-6,0.30864384222275937,-1.7958028295863571E-2,3.5831008668331919E-8,1.8929080450019731E-4,7.2195945517669516E-2,7.2006654713169319E-2,0.34408534040824634,0.65591465959175366,4.9790567600379916,19406.928522634469,1375693.3246401292,1.1846974857372139,8546.1755662144151,378131.69990953914,1.0000000000003233,1.0000000000003233,17966396649.946022,378131.69990953914,0.88782289213300014,1.0010379668245579,1.0390959936800934,0.15590265697430797,0.99988298859621449,1.8790580732054032,3.2319228696377877E-13,3.2319228696374409E-13,0.99999999994434052,1.8790580732054032,3.8834324239045634E-2,1.3132338276160954E-5,"","","","","","",9.5758027364179367E-13,"",5.6509377825601795E-2,5.6509377825601795E-2,null,5.6509377815557649E-2,0.81446044402540119,null,-1.7958028295863571E-2]
[10.964314219017979,5.520561666922843,5.5227131843566895,3.7157487977276133E-6,0.26518065047287009,2.1515174338464504E-3,5.1974113032365062E-10,-2.2797831702239812E-5,7.1094172044976367E-2,7.1116969876678607E-2,0.35409517360742337,0.64590482639257663,3.8916857646520224,14696.739298181985,1025173.7681971114,1.1399040607599868,6517.9793660764262,223833.61648679854,1.0000000000002449,1.0000000000002449,13609128670.940081,223833.61648679854,0.80668055923018633,1.0007630622765042,1.029897368224477,0.12273318920077468,0.99984657821943945,1.8462857152823116,2.4481065926527081E-13,2.4481065926525541E-13,0.99999999992651989,1.8462857152823116,4.11089171442066E-2,1.0190595740030543E-5,"","","","","","",1.3009472618314348E-12,"",5.9273995860216928E-2,5.9273995860216928E-2,null,5.9273995845767327E-2,0.81169334853758335,null,2.1515174338464504E-3]
[11.448833580652718,5.6553593662136379,5.6611342430114746,2.7347110163886716E-6,0.26783042457698436,5.7748767978367255E-3,3.7887625671939198E-9,-6.1552924928015562E-5,6.999885311154623E-2,7.0060406036474246E-2,0.36404636602153745,0.6359536339784625,3.0309081818080603,10731.887262769278,737048.7996686534,1.1021809244341345,4797.3563298159552,125213.3220978031,1.0000000000001787,1.0000000000001787,9939621057.6268063,125213.3220978031,0.71258874336196842,1.0005186136770599,1.0220127870328604,9.2707941290668561E-2,0.99979155186080615,1.8008352351854877,1.7880095323958857E-13,1.7880095323958244E-13,0.99999999989939259,1.8008352351854877,4.3876269396316191E-2,7.866817402525722E-6,"","","","","","",1.8312889591610727E-12,"",6.2529187809233583E-2,6.2529187809233583E-2,null,6.2529187790368521E-2,0.80859154092743213,null,5.7748767978367255E-3]
[11.939793326018844,5.7817578076145644,5.8000121116638184,2.0512444129868422E-6,0.26326115232568381,1.8254304049253989E-2,3.6987136343195942E-8,-1.923204002262785E-4,6.8922871850528825E-2,6.9115192250755103E-2,0.37382187179941551,0.62617812820058449,2.4673786263954094,7993.2003620266696,542174.35428418964,1.0761144254762856,3598.637580449471,73704.126137682528,1.0000000000001332,1.0000000000001332,7404009608.1435394,73704.126137682528,0.62306447206110394,1.0003338418806083,1.0164890624320893,7.0730791888230241E-2,0.99972211705745728,1.7496936780104007,1.3318857592263603E-13,1.3318857592263343E-13,0.99999999986493804,1.7496936780104007,4.6481132120868421E-2,6.4172905937383989E-6,"","","","","","",2.5244556097567422E-12,"",6.5614251072327046E-2,6.5614251072327046E-2,null,6.5614251053278894E-2,0.80579539516184617,null,1.8254304049253989E-2]
[12.423383911664132,5.9118777988780709,5.9385132789611816,1.5253056646086688E-6,0.2937350436623728,2.6635480083110785E-2,7.2609237050901384E-8,-2.6946101211659801E-4,6.7894896113839545E-2,6.8164357125956143E-2,0.38316123775084709,0.61683876224915291,2.055791171140557,5903.4972555333288,396063.52605285635,1.0562195699444352,2676.2038645059329,43478.464728345469,1.0000000000000984,1.0000000000000984,5468743059.5384216,43478.464728345469,0.53174675535811944,1.0001719078983538,1.0122306962393628,5.3227161798746842E-2,0.99962633638891907,1.6886792058911237,9.8375628603269485E-14,9.8375628603268425E-14,0.9999999998171426,1.6886792058911237,4.9149315596963256E-2,5.527509851312829E-6,"","","","","","",3.5031929053838845E-12,"",6.8741769671686798E-2,6.8741769671686798E-2,null,6.8741769657228322E-2,0.80309203382488947,null,2.6635480083110785E-2]
[12.881495391775388,6.0577402761172214,6.0759644508361816,1.0939165261365708E-6,0.30274812245743393,1.8224174718960207E-2,2.8854874968704835E-8,-1.6986722747105998E-4,6.6948971028008702E-2,6.7118838255479762E-2,0.3917551570661662,0.60824484293383374,1.73408674173595,4204.7957707872683,279191.48421491974,1.0400437982251742,1919.5988658334045,24662.494278038786,1.0000000000000702,1.0000000000000702,3895249356.3023076,24662.494278038786,0.43402968913501039,1.0000069555378093,1.0087406053395447,3.8502030677466249E-2,0.99947905782932112,1.611724432127922,7.0070507877572948E-14,7.0070507877572557E-14,0.99999999974327702,1.611724432127922,5.2063543885738264E-2,5.1507296961707811E-6,"","","","","","",5.028627454007881E-12,"",7.2079139116861521E-2,7.2079139116861521E-2,null,7.2079139109481119E-2,0.80034187518286959,null,1.8224174718960207E-2]
[13.297209756274242,6.1770905069722941,6.2145247459411621,8.3305378924018614E-7,0.47219089696073652,3.7434238968867994E-2,9.7172099712805151E-8,-3.1172439704457711E-4,6.6113115737175626E-2,6.6424840134220203E-2,0.39934907019554783,0.60065092980445223,1.5476411586872996,3186.8617753238705,210142.93785306238,1.0303491087530847,1462.0767979337581,15847.4701593586,1.0000000000000531,1.0000000000000531,2952201129.3668365,15847.4701593586,0.36064209474233899,0.99987261590888821,1.0066364936751915,2.9455170577876156E-2,0.99931604139986818,1.5441949202833021,5.310628754277312E-14,5.310628754277295E-14,0.99999999966126973,1.5441949202833021,5.4108276145575562E-2,5.2718102535820928E-6,"","","","","","",6.7635816920305315E-12,"",7.4498289606094836E-2,7.4498289606094836E-2,null,7.4498289602945134E-2,0.79842926868475694,null,3.7434238968867994E-2]
[13.659096746414434,6.4149534237326344,6.3485226631164551,4.8367061809937322E-7,0.43065655041766648,-6.6430760616179363E-2,1.9739372707390475E-7,4.4429013839371312E-4,6.5402298193758771E-2,6.4958008055365057E-2,0.40580699028619899,0.59419300971380107,1.3078586612552421,1835.807344019654,119731.9224102134,1.0174800812414895,849.30046639824343,6965.5216508141493,1.0000000000000306,1.0000000000000306,1700370050.9054568,6965.5216508141493,0.23799072955311626,0.9995634901961632,1.0038275780577277,1.7179777337911976E-2,0.99882256040169048,1.4073558492418226,3.0587462306897754E-14,3.0587462306897722E-14,0.99999999941189277,1.4073558492418226,5.8016842916659435E-2,6.8075992987392324E-6,"","","","","","",1.1932902195910368E-11,"",7.8726638499377347E-2,7.8726638499377347E-2,null,7.8726638499069912E-2,0.79523753505892381,null,-6.6430760616179363E-2]
[13.962769800855312,6.4769112381131961,6.4886946678161621,4.1963201232965797E-7,0.40620512125552644,1.1783429702965975E-2,4.6419851305991997E-9,-6.8132115265850945E-5,6.4817513272611024E-2,6.4885645387876875E-2,0.41111987870034311,0.58888012129965683,1.265683119575117,1590.8264186291308,103561.91602975539,1.0151463822210307,736.98440437360853,5700.0897600567478,1.0000000000000264,1.0000000000000264,1473360126.5772376,5700.0897600567478,0.21192156076222632,0.99946527193878176,1.0033158523303078,1.4920392257018199E-2,0.99864311918398063,1.3732263838422496,2.6503846796356989E-14,2.6503846796356967E-14,0.99999999932127936,1.3732263838422496,5.8448374731728224E-2,7.4654020237891636E-6,"","","","","","",1.3951778363088173E-11,"",7.9420755773938784E-2,7.9420755773938784E-2,null,7.9420755773796356E-2,0.7947309933904303,null,1.1783429702965975E-2]
[14.210002183972392,6.6273230229128508,6.625999927520752,2.972655449631006E-7,0.68177706441362218,-1.3230953920988497E-3,3.6916065714499604E-11,6.0758592572984771E-6,6.4349083361734907E-2,6.4343007502477609E-2,0.41537565848592289,0.58462434151407716,1.1859008384693921,1123.6342317711826,72828.643776106575,1.0106957041029363,522.36824318014737,3572.4676470239374,1.0000000000000187,1.0000000000000187,1040421648.2471265,3572.4676470239374,0.15781790083912539,0.99917651648827766,1.0023368832656188,1.0582516636329821E-2,0.99808564166551916,1.2958724838284008,1.8715842418159223E-14,1.8715842418159217E-14,0.99999999903885117,1.2958724838284008,5.9987955164142376E-2,9.8116466521224907E-6,"","","","","","",1.9961890411725683E-11,"",8.1172464545748085E-2,8.1172464545748085E-2,null,8.1172464545728393E-2,0.79347345534586955,null,-1.3230953920988497E-3]
[14.406663844420109,6.7758363854579944,6.7635617256164551,2.1141722493451103E-7,0.85865529935861806,-1.2274659841539304E-2,1.927649846647844E-9,4.390500935710917E-5,6.3981276775213439E-2,6.393737176585633E-2,0.41871725516789693,0.58128274483210307,1.1310281440121031,797.53968129314262,51518.977580595507,1.0075890403358128,371.80054856613265,2311.6335352127494,1.0000000000000133,1.0000000000000133,738221792.77932763,2311.6335352127494,0.11640357776071433,0.99879341273121558,1.0016495767760858,7.5318805902091579E-3,0.99731038589411303,1.2294474270150688,1.3279657107075863E-14,1.327965710707586E-14,0.99999999864539357,1.2294474270150688,6.114156140712735E-2,1.3271097343439357E-5,"","","","","","",2.8359854671281811E-11,"",8.2494259014804047E-2,8.2494259014804047E-2,null,8.2494259014801771E-2,0.79254375199626093,null,-1.2274659841539304E-2]
[14.560617950337473,6.9239615864208544,6.9013829231262207,1.5044953819332867E-7,1.0727361569581531,-2.257866329463365E-2,3.8580491755427009E-9,6.2113196468566167E-5,6.3696265081396697E-2,6.3634151884928131E-2,0.42130664362716619,0.57869335637283381,1.0926308328873278,566.84905584517332,36518.123318208724,1.0053912065145711,264.87051154837644,1530.4840676383017,1.0000000000000093,1.0000000000000093,524428117.98572743,1530.4840676383017,8.5066127766687663E-2,0.99826948283387495,1.0011588181798758,5.3622972626356687E-3,0.99622457028472433,1.174266114062358,9.4337848700523669E-15,9.4337848700523653E-15,0.99999999809316098,1.174266114062358,6.1998177756121743E-2,1.8254938010974644E-5,"","","","","","",4.0168197430503935E-11,"",8.3483516508280009E-2,8.3483516508280009E-2,null,8.3483516508279801E-2,0.79185844834501118,null,-2.257866329463365E-2]
[14.680155283713248,7.0654141329579554,7.0395674705505371,1.0869281779098204E-7,1.1571971716393483,-2.5846662407418286E-2,3.0075873747580045E-9,5.4841474950606539E-5,6.3476713536383789E-2,6.3421872061433182E-2,0.42330131349231448,0.57669868650768552,1.0666158597311048,409.30195000071848,26310.52138058448,1.0038901906560997,191.63421381384265,1049.593896971109,1.0000000000000069,1.0000000000000069,378417217.06841499,1049.593896971109,6.2608566084576184E-2,0.99758108918944699,1.0008182064551736,3.8751157171456395E-3,0.9947817251413601,1.1316921377337283,6.8072372391745354E-15,6.8072372391745354E-15,0.99999999735741407,1.1316921377337283,6.2591563460737326E-2,2.4968876998980895E-5,"","","","","","",5.5930504004497343E-11,"",8.4181965021776189E-2,8.4181965021776189E-2,null,8.4181965021776189E-2,0.79137990687388182,null,-2.5846662407418286E-2]
[14.773074111144524,7.1705109682570018,7.1782851219177246,8.5358228691359987E-8,1.6898336051436016,7.7741536607227602E-3,1.7533776335093832E-10,-1.3241516655992935E-5,6.3307094313989482E-2,6.3320335830645474E-2,0.42484233818170991,0.57515766181829009,1.0521847984003636,321.43575387201298,20631.603679391705,1.0030530412294894,150.70813297352623,799.90857274742882,1.0000000000000053,1.0000000000000053,296983739.00623405,799.90857274742882,4.9692086050356694E-2,0.99690800791945167,1.0006236085889892,3.0437485397053982E-3,0.99336465802959906,1.1058801426029301,5.3423540865684296E-15,5.3423540865684296E-15,0.99999999663281225,1.1058801426029301,6.2887551024307611E-2,3.1589611753980818E-5,"","","","","","",7.1526195273067111E-11,"",8.4560563671729372E-2,8.4560563671729372E-2,null,8.4560563671729372E-2,0.7911223200167341,null,7.7741536607227602E-3]
[14.84628180769505,7.335126270298276,7.3167929649353027,{"$f":"IF(A73=\"\",\"\",10^-((((B73-P$12)/P$13)+7))/$AU73)","v":5.8453599736464241E-8},2.080550712094837,-1.8333305362973285E-2,5.9454087448641872E-10,2.4383208863609784E-5,6.3174093996319708E-2,6.3149710787456098E-2,0.42605067276981523,0.57394932723018477,1.0356252822969083,220.25115062331355,14102.358251583109,1.0020889892159301,103.52062884024733,528.68354874960835,1.0000000000000036,1.0000000000000036,203205847.02961558,528.68354874960835,3.4445079260595646E-2,0.99547275514584654,1.000389034543,2.0846344370720393E-3,0.99034008959177411,1.0739316092787252,3.6554108624954769E-15,3.6554108624954769E-15,0.99999999507888171,1.0739316092787252,6.3301365748265837E-2,4.5856406722739183E-5,"","","","","","",1.0483228681596989E-10,"",8.50482533766449E-2,8.50482533766449E-2,null,8.5048253376644886E-2,0.79079236628453975,null,-1.8333305362973285E-2]
[14.905741201073397,7.4488420585508965,7.4554896354675293,4.499674719347262E-8,2.8914921964778917,6.6475769166327581E-3,5.6059264338711804E-11,-7.4872734916464623E-6,6.3066481518343376E-2,6.3073968791835022E-2,0.42702835373726505,0.572971646262735,1.0273830783279048,169.70934445318844,10846.314883198798,1.0016074399697257,79.918917548934601,399.7752665084231,1.0000000000000029,1.0000000000000029,156363277.79388049,399.7752665084231,2.6680234991802127E-2,0.99411758660725524,1.0002617520083688,1.6048602532088721E-3,0.98748731801343914,1.0568467531228911,2.8127735084405639E-15,2.8127735084405639E-15,0.99999999360463654,1.0568467531228911,6.3471194481960119E-2,5.9342415980184796E-5,"","","","","","",1.3655007741017611E-10,"",8.527980819624259E-2,8.527980819624259E-2,null,8.527980819624259E-2,0.7906364304313902,null,6.6475769166327581E-3]
[14.956614199036267,7.6457454612215425,7.5933661460876465,2.8602075392979729E-8,3.1988041364721331,-5.2379315133896043E-2,2.6781053472269888E-9,5.1750413981213605E-5,6.2974699717979643E-2,6.2922949303998429E-2,0.42786220982032669,0.57213779017967326,1.0173707696306991,108.18013786676644,6886.3053187600763,1.0010212017032238,51.164622343955166,248.70680516995796,1.0000000000000018,1.0000000000000018,99337113.172728986,248.70680516995796,1.7085165712738073E-2,0.99076250291890267,1.0000796642164671,1.0201599141819095E-3,0.98045524516378757,1.0344604694350505,1.7869464189063002E-15,1.7869464189063002E-15,0.999999989933269,1.0344604694350505,6.372152243087531E-2,9.2864869873545235E-5,"","","","","","",2.153586892928693E-10,"",8.5604867320664885E-2,8.5604867320664885E-2,null,8.5604867320664885E-2,0.79041830925752476,null,-5.2379315133896043E-2]
[15.003504943160806,7.7642439426149625,7.7303175926208496,2.1774343767850104E-8,2.4735614723517472,-3.3926349994112925E-2,1.0920557527999819E-9,3.3046266851188832E-5,6.2890338722256772E-2,6.2857292455405583E-2,0.42862864640337339,0.57137135359662661,1.0132136780499055,82.577267964888392,5240.1804844976105,1.0007772612909938,39.189596974831957,187.75599805482159,1.0000000000000013,1.0000000000000013,75607877.296344027,187.75599805482159,1.3047741062349034E-2,0.98789494537121447,0.99998032984222762,7.766576250853866E-4,0.97448302413923238,1.0241970565565353,1.3600880963007156E-15,1.3600880963007156E-15,0.99999998677386492,1.0241970565565353,6.3780199539943669E-2,1.214593688006941E-4,"","","","","","",2.8345501932514875E-10,"",8.573001391014598E-2,8.573001391014598E-2,null,8.573001391014598E-2,0.79033457618501024,null,-3.3926349994112925E-2]
[15.050747345958371,7.8785707528177369,7.8659453392028809,1.6736051822460672E-8,2.6789506656145434,-1.2625413614856029E-2,1.7131297412859456E-10,1.3088658224913452E-5,6.2805573319548891E-2,6.2792484661323977E-2,0.42939875710507042,0.57060124289492953,1.0101501837411,63.691276021955709,4026.4561077528156,1.0005973178351228,30.353034969227039,143.51118789753539,1.0000000000000011,1.0000000000000011,58103927.582822151,143.51118789753539,1.0051974504243742E-2,0.98430295048699301,0.99988317738084131,5.9696125951566711E-4,0.96705436537025591,1.0158394017511752,1.0452146358811575E-15,1.0452146358811575E-15,0.99999998278945945,1.0158394017511752,6.3800978740563605E-2,1.5723714936942523E-4,"","","","","","",3.6950923540667663E-10,"",8.582465103153665E-2,8.582465103153665E-2,null,8.582465103153665E-2,0.79027134569291391,null,-1.2625413614856029E-2]
[15.102709837083239,8.0312312097087091,8.000582218170166,1.1777023889858332E-8,2.318036706325743,-3.0648991538543058E-2,1.3694120544335032E-9,3.7005567884218493E-5,6.2712602319265565E-2,6.2675596751381346E-2,0.4302434173081538,0.56975658269184626,1.0071375631230071,45.10655821183893,2832.4486953511837,1.0004202444867307,21.655492570147139,100.56172688423037,1.0000000000000007,1.0000000000000007,40879166.777497992,100.56172688423037,7.0888557510205086E-3,0.97783285289498889,0.99973948411107205,4.2006795548847354E-4,0.95382233875490163,1.0061637170113673,7.3536342353601365E-16,7.3536342353601365E-16,0.99999997553766184,1.0061637170113673,6.3811968205006855E-2,2.2166675421984007E-4,"","","","","","",5.2623799752320547E-10,"",8.5941917534501255E-2,8.5941917534501255E-2,null,8.5941917534501255E-2,0.79019310214667948,null,-3.0648991538543058E-2]
[15.16410350886872,8.1354884830845489,8.134885311126709,9.2639529581840176E-9,1.8311608678704774,-6.0317195783987643E-4,7.5128529277352796E-13,8.6676715026212658E-7,6.2603111203627396E-2,6.2602244436477134E-2,0.43123816607592996,0.56876183392407009,1.005612777731052,35.691860667029168,2227.8382212395763,1.0003305420321393,17.247866463338251,79.031530851432251,1.0000000000000007,1.0000000000000007,32153385.410509866,79.031530851432251,5.5826125969468321E-3,0.97198442354645775,0.99962391236799808,3.3043281020672747E-4,0.94202181457482981,1.0000257739147103,5.7839788040093262E-16,5.7839788040093262E-16,0.99999996889907583,1.0000257739147103,6.3754063010734843E-2,2.7963588520922312E-4,"","","","","","",6.7059527413709396E-10,"",8.5991213215872886E-2,8.5991213215872886E-2,null,8.5991213215872886E-2,0.79016024578083632,null,-6.0317195783987643E-4]
[15.240280378202442,8.2851109395244986,8.2692437171936035,6.5645802521581926E-9,1.6569367789215488,-1.5867222330895103E-2,8.4393116694131578E-10,2.9050493402717203E-5,6.2467785690582013E-2,6.2438735197179296E-2,0.43246762553084511,0.56753237446915494,1.0039752425128043,25.579429429505403,1578.4578404282538,1.0002341915165691,12.513489307035725,56.070592014654927,1.0000000000000004,1.0000000000000004,22780915.757478479,56.070592014654927,3.9600866696661331E-3,0.96090749872943448,0.9994180255755839,2.3413668374412766E-4,0.92008623850121896,0.99113490384696468,4.0979924977794276E-16,4.0979924977794276E-16,0.99999995610360837,0.99113490384696468,6.3673763637483657E-2,3.8932821206559418E-4,"","","","","","",9.4918841308843232E-10,"",8.6081582912331228E-2,8.6081582912331228E-2,null,8.6081582912331228E-2,0.79010006680850886,null,-1.5867222330895103E-2]
[15.337496060237754,8.4163256715274422,8.4039196968078613,4.853073744199056E-9,1.0728061310714274,-1.2405974719580826E-2,8.4044907478382053E-10,2.8990499733254349E-5,6.2295932869408897E-2,6.2266942369675643E-2,0.43402894291357896,0.56597105708642104,1.0029377097010848,19.169050757116626,1166.9051048044753,1.0001731138305707,9.5117114139509145,41.606486331904975,1.0000000000000002,1.0000000000000002,16839600.80850447,41.606486331904975,2.9294242434508163E-3,0.94783360571153075,0.9991811338558535,1.7308386735941209E-4,0.89486644868837262,0.98256944265431301,3.0292266318221047E-16,3.0292266318221047E-16,0.99999994061616948,0.98256944265431301,6.353502818786122E-2,5.1808687278907925E-4,"","","","","","",1.2887150587749749E-9,"",8.6149021342099313E-2,8.6149021342099313E-2,null,8.6149021342099313E-2,0.79005520359539361,null,-1.2405974719580826E-2]
[15.463084501971025,8.5162795307449155,8.5389704704284668,3.8554032506285902E-9,0.99816342344360975,2.2690939683551292E-2,4.3555833181155555E-9,-6.5996843243563974E-5,6.2075318976250377E-2,6.2141315819493941E-2,0.43603326442491463,0.56396673557508537,1.0023335192684422,15.433494935237343,927.1591168955847,1.0001375216673802,7.7619165880148282,33.211918057613694,1.0000000000000002,1.0000000000000002,13377383.01532316,33.211918057613694,2.3282883013222336E-3,0.9352066692341483,0.99895169790094218,1.3750275777164389E-4,0.87116584046469925,0.97511127781657614,2.4064183428117344E-16,2.4064183428117344E-16,0.99999992524696357,0.97511127781657614,6.3331202281907889E-2,6.4120221730865621E-4,"","","","","","",1.6297405252038427E-9,"",8.6167565798717372E-2,8.6167565798717372E-2,null,8.6167565798717372E-2,0.7900428737415871,null,2.2690939683551292E-2]
[15.625451547384728,8.7111918529670387,8.674278736114502,2.4616575271215111E-9,0.83167890294500124,-3.6913116852536731E-2,2.1118531328091156E-8,1.453221639258484E-4,6.1792403653145457E-2,6.1647081489219609E-2,0.4386036069353848,0.5613963930646152,1.001488451629531,10.212741827203033,591.96000337755913,1.0000877786023565,5.317453139030424,21.513860008362585,1.0000000000000002,1.0000000000000002,8538640.1749321353,21.513860008362585,1.486321585667108E-3,0.90208359911442815,0.99833000061962929,8.7770897949764737E-5,0.81194004463152858,0.95680095205464033,1.5359909666640325E-16,1.5359909666640325E-16,0.99999988288533304,0.95680095205464033,6.3072088387255101E-2,9.6456138124608002E-4,"","","","","","",2.5683457667126185E-9,"",8.6359730163169196E-2,8.6359730163169196E-2,null,8.6359730163169196E-2,0.78991527945488438,null,-3.6913116852536731E-2]
[15.83374493784504,8.8076140254745106,8.8099255561828613,1.9715555135191421E-9,0.47433538667689767,2.311530708350773E-3,1.2343303359597466E-10,-1.1110042015941013E-5,6.1433218497255915E-2,6.1444328539271856E-2,0.44186687618916914,0.55813312381083091,1.0011920377876353,8.3784158851434132,474.28592975214855,1.0000703012324901,4.4578727734598438,17.417868529060172,1.0000000000000002,1.0000000000000002,6838533.873280474,17.417868529060172,1.1906712327768331E-3,0.88064608428942726,0.99790702117515451,7.0296290574193158E-5,0.77567776138575606,0.94518836118636895,1.2301637887944863E-16,1.2301637887944863E-16,0.9999998537698257,0.94518836118636895,6.2715772201365552E-2,1.1689009138422539E-3,"","","","","","",3.2307135153313482E-9,"",8.636946747769364E-2,8.636946747769364E-2,null,8.636946747769364E-2,0.78990882236727844,null,2.311530708350773E-3]
[16.097023374459241,8.9355029984547709,8.9457507133483887,1.4687580495018501E-9,0.45565432256897198,1.0247714893617754E-2,3.6960539896203783E-9,-6.0795180644689084E-5,6.0985147154797796E-2,6.1045942335442485E-2,0.4459376942933424,0.5540623057066576,1.0008876566878544,6.4959640861631698,353.48629570468978,1.0000523653177706,3.5760261049444306,13.218877652986558,1,1,5093822.7483580792,13.218877652986558,8.8689869267834698E-4,0.84605854041267115,0.99718253894193143,5.2362575787711609E-5,0.72035998321786876,0.92625163103236818,9.1631277899987474E-17,9.1631277899987474E-17,0.99999980368378538,0.92625163103236818,6.226885988832867E-2,1.4966359562409517E-3,"","","","","","",4.3772400054270051E-9,"",8.6452408556328506E-2,8.6452408556328506E-2,null,8.6452408556328506E-2,0.78985385436735944,null,1.0247714893617754E-2]
[16.422776044055354,9.0741280413936671,9.0817131996154785,1.0675119873172551E-9,0.39395823176258093,7.5851582218113833E-3,2.9816907945223886E-9,-5.4604860539354816E-5,6.0439717161560644E-2,6.0494322022099999E-2,0.45089303528624786,0.54910696471375209,1.0006447307021631,4.9936615818514003,257.07854487634302,1.0000380514452623,2.8722884600380829,9.8719570132387382,1,1,3701444.7739503509,9.8719570132387382,6.4433072559689272E-4,0.79974633258996064,0.99611848802100567,3.8049997404803817E-5,0.65184555314937231,0.90004677119378063,6.658419548958045E-17,6.658419548958045E-17,0.99999972983522356,0.90004677119378063,6.1720269025111886E-2,1.9294727962607507E-3,"","","","","","",6.0907708046800633E-9,"",8.6583050825817395E-2,8.6583050825817395E-2,null,8.6583050825817395E-2,0.78976739113363115,null,7.5851582218113833E-3]
[16.814808531489689,9.2161862707342443,9.2177720069885254,7.6979587826164677E-10,0.3550392573377037,1.5857362542810449E-3,1.8041713226054163E-10,-1.3431944470572443E-5,5.9796108418127762E-2,5.9809540362598335E-2,0.45674034993573515,0.5432596500642648,1.0004645280739721,3.8790681953765156,185.55711695217383,1.0000274316465978,2.3501299812812562,7.391411391577245,1,1,2668406.8071559705,7.391411391577245,4.6432040334936519E-4,0.74220625844490629,0.99461683417844393,2.7430894123123255E-5,0.57449162047844915,0.86564034994012173,4.8001175962610282E-17,4.8001175962610282E-17,0.99999962524454766,0.86564034994012173,6.1069132715951144E-2,2.4574271408088423E-3,"","","","","","",8.5582968217379143E-9,"",8.6751105997088268E-2,8.6751105997088268E-2,null,8.6751105997088268E-2,0.78965637866679395,null,1.5857362542810449E-3]
[17.270861055294517,9.3747626213641411,9.3538632392883301,5.3443913265893984E-10,0.27525838712905137,-2.0899382075810991E-2,4.0583455569816206E-8,2.0145335829867966E-4,5.9064433179465137E-2,5.8862979821166457E-2,0.46338776637523116,0.53661223362476884,1.0003220610612511,2.9979129354503464,129.01373949511103,1.0000190360355319,1.9373423741917368,5.4317984239493073,1,1,1851726.0715392188,5.4317984239493073,3.2196122653087121E-4,0.66643468890217095,0.99225304854568419,1.9035673168166504E-5,0.48382897451608053,0.81650969589711897,3.3310143740102388E-17,3.3310143740102388E-17,0.99999945996331996,0.81650969589711897,6.0326652475985731E-2,3.1408128377612425E-3,"","","","","","",1.2512319546001942E-8,"",8.7024398507915879E-2,8.7024398507915879E-2,null,8.7024398507915879E-2,0.78947635647256631,null,-2.0899382075810991E-2]
[17.780781710462179,9.4781753820591188,9.4900803565979004,4.2120293788466257E-10,0.2261984371227721,1.1904974538781588E-2,1.5005841234133771E-8,-1.2249833155653089E-4,5.82672507734791E-2,5.8389749105035631E-2,0.47063032858153808,0.52936967141846192,1.0002538018873754,2.5745551803675899,101.8847987294686,1.0000150022999443,1.7387396200743761,4.4920514615772511,1,1,1459345.5621113647,4.4920514615772511,2.5373988276836926E-4,0.61158344588923397,0.99018826557283945,1.5002074878700154E-5,0.42487075784399264,0.7778432719751851,2.6251724879357051E-17,2.6251724879357051E-17,0.9999993147613383,0.7778432719751851,5.9514690065046345E-2,3.607923465307201E-3,"","","","","","",1.6124704826615412E-8,"",8.7040715764705012E-2,8.7040715764705012E-2,null,8.7040715764705012E-2,0.78946562783847363,null,1.1904974538781588E-2]
[18.326342337240931,9.6143446978506706,9.6262354850769043,3.078848709580271E-10,0.23726722187081739,1.1890787226233712E-2,1.5970113203008671E-8,-1.2637291324887889E-4,5.7437839044779754E-2,5.7564211958028633E-2,0.47816570065527997,0.52183429934472003,1.0001853502016527,2.1505944781063659,74.698256042441258,1.0000109628192952,1.5399932719853504,3.5506066909513487,1,1,1066406.2034206337,3.5506066909513487,1.8531713083677634E-4,0.53501232758037942,0.98661518929605296,1.096269911314354E-5,0.35064651372742311,0.71866778748481719,1.9183253041765598E-17,1.9183253041765598E-17,0.99999906227102131,0.71866778748481719,5.8669751928797975E-2,4.2576948226429392E-3,"","","","","","",2.2419491705951383E-8,"",8.7224160763593711E-2,8.7224160763593711E-2,null,8.7224160763593725E-2,0.78934516544487965,null,1.1890787226233712E-2]
[18.883451000147033,9.7396602970849475,9.7623715400695801,2.3073778918356198E-10,0.28386297888986095,{"$f":"IF(A91=\"\",\"\",IF(C91=\"\",\"0,00001\",(IF(ABS(C91-B91)<0.00001,0.00001,C91-B91))))","v":2.2711242984632563E-2},5.6664852789042865E-8,-2.3804380434920558E-4,5.6614889515162838E-2,5.6852933319512043E-2,0.4856423623529616,0.51435763764703835,1.0001388183329387,1.8621060664671361,56.208178194822636,1.0000082141131068,1.4046865094871241,2.9104822209317858,1,1,799026.57204372587,2.9104822209317858,1.3879978186591375E-4,0.46297368690468732,0.98221077194433282,8.2140456357078859E-6,0.28809738454374584,0.65662645264526409,1.4373438619942657E-17,1.4373438619942657E-17,0.99999874847716586,0.65662645264526409,5.7830646600455823E-2,4.8468680589321645E-3,"","","","","","",3.0389625285602224E-8,"",8.7351663134341145E-2,8.7351663134341145E-2,null,8.7351663134341145E-2,0.78926160406799306,null,2.2711242984632563E-2]
[19.426484357973095,9.9258049194563522,9.8983235359191895,{"$f":"IF(A92=\"\",\"\",10^-((((B92-P$12)/P$13)+7))/$AU92)","v":1.5035835624469762E-10},0.27614741342926019,-2.7481383537162785E-2,7.1993603332104511E-8,2.683162375483536E-4,{"$f":"IF(A92=\"\",\"\",L92*I$18+K92*E$19)","v":5.5835114852090376E-2},{"$f":"IF(A92=\"\",\"\",D92 -$AC$9/AU92^2/D92+L92*(W92*$B$11+X92*$C$11+Y92*$D$11+Z92*$E$11+AA92*$F$11+AB92*$G$11+AC92*$H$11)+K92*(AD92*$B$18+AE92*$C$18+AF92*$D$18))","v":5.5566798614542022E-2},{"$f":"IF(A92=\"\",\"\",A92/(A92+$G$16))","v":0.49272677171999835},{"$f":"IF(A92=\"\",\"\",$E$16/(A92+$G$16))","v":0.50727322828000165},{"$f":"IF($A92=\"\",\"\",(1+(V$5*$AU92^(-2*V$4))*$D92+(V$6*$AU92^(-4*V$4-2))*$D92^2+(V$7*$AU92^(-6*V$4-6))*$D92^3+(V$8*$AU92^(-8*V$4-12))*$D92^4+(V$9*$AU92^(-10*V$4-20))*$D92^5+(V$10*$AU92^(-12*V$4-30))*$D92^6))","v":1.0000902680574075},{"$f":"IF($A92=\"\",\"\",(1+(W$5*$AU92^(-2*W$4))*$D92+(W$6*$AU92^(-4*W$4-2))*$D92^2+(W$7*$AU92^(-6*W$4-6))*$D92^3+(W$8*$AU92^(-8*W$4-12))*$D92^4+(W$9*$AU92^(-10*W$4-20))*$D92^5+(W$10*$AU92^(-12*W$4-30))*$D92^6))","v":1.5613873295811935},{"$f":"IF($A92=\"\",\"\",(1+(X$5*$AU92^(-2*X$4))*$D92+(X$6*$AU92^(-4*X$4-2))*$D92^2+(X$7*$AU92^(-6*X$4-6))*$D92^3+(X$8*$AU92^(-8*X$4-12))*$D92^4+(X$9*$AU92^(-10*X$4-20))*$D92^5+(X$10*$AU92^(-12*X$4-30))*$D92^6))","v":36.92511161897842},{"$f":"IF($A92=\"\",\"\",(1+(Y$5*$AU92^(-2*Y$4))*$D92+(Y$6*$AU92^(-4*Y$4-2))*$D92^2+(Y$7*$AU92^(-6*Y$4-6))*$D92^3+(Y$8*$AU92^(-8*Y$4-12))*$D92^4+(Y$9*$AU92^(-10*Y$4-20))*$D92^5+(Y$10*$AU92^(-12*Y$4-30))*$D92^6))","v":1.0000053488767615},{"$f":"IF($A92=\"\",\"\",(1+(Z$5*$AU92^(-2*Z$4))*$D92+(Z$6*$AU92^(-4*Z$4-2))*$D92^2+(Z$7*$AU92^(-6*Z$4-6))*$D92^3+(Z$8*$AU92^(-8*Z$4-12))*$D92^4+(Z$9*$AU92^(-10*Z$4-20))*$D92^5+(Z$10*$AU92^(-12*Z$4-30))*$D92^6))","v":1.2637105893065526},{"$f":"IF($A92=\"\",\"\",(1+(AA$5*$AU92^(-2*AA$4))*$D92+(AA$6*$AU92^(-4*AA$4-2))*$D92^2+(AA$7*$AU92^(-6*AA$4-6))*$D92^3+(AA$8*$AU92^(-8*AA$4-12))*$D92^4+(AA$9*$AU92^(-10*AA$4-20))*$D92^5+(AA$10*$AU92^(-12*AA$4-30))*$D92^6))","v":2.2430512253119521},{"$f":"IF($A92=\"\",\"\",(1+(AB$5*$AU92^(-2*AB$4))*$D92+(AB$6*$AU92^(-4*AB$4-2))*$D92^2+(AB$7*$AU92^(-6*AB$4-6))*$D92^3+(AB$8*$AU92^(-8*AB$4-12))*$D92^4+(AB$9*$AU92^(-10*AB$4-20))*$D92^5+(AB$10*$AU92^(-12*AB$4-30))*$D92^6))","v":1},{"$f":"IF($A92=\"\",\"\",(1+(AC$5*$AU92^(-2*AC$4))*$D92+(AC$6*$AU92^(-4*AC$4-2))*$D92^2))","v":1},{"$f":"IF($A92=\"\",\"\",(1+(AD$5*$AU92^(-2*AD$4))*$D92+(AD$6*$AU92^(-4*AD$4-2))*$D92^2))","v":520311.50200894469},{"$f":"IF($A92=\"\",\"\",(1+(AE$5*$AU92^(-2*AE$4))*$D92+(AE$6*$AU92^(-4*AE$4-2))*$D92^2))","v":2.2430512253119521},{"$f":"IF($A92=\"\",\"\",((V$5*$AU92^(-2*V$4))*$D92+2*(V$6*$AU92^(-4*V$4-2))*$D92^2+3*(V$7*$AU92^(-6*V$4-6))*$D92^3+4*(V$8*$AU92^(-8*V$4-12))*$D92^4+5*(V$9*$AU92^(-10*V$4-20))*$D92^5+6*(V$10*$AU92^(-12*V$4-30))*$D92^6)/M92)","v":9.0260213133875599E-5},{"$f":"IF($A92=\"\",\"\",((W$5*$AU92^(-2*W$4))*$D92+2*(W$6*$AU92^(-4*W$4-2))*$D92^2+3*(W$7*$AU92^(-6*W$4-6))*$D92^3+4*(W$8*$AU92^(-8*W$4-12))*$D92^4+5*(W$9*$AU92^(-10*W$4-20))*$D92^5+6*(W$10*$AU92^(-12*W$4-30))*$D92^6)/N92)","v":0.35954393752423697},{"$f":"IF($A92=\"\",\"\",((X$5*$AU92^(-2*X$4))*$D92+2*(X$6*$AU92^(-4*X$4-2))*$D92^2+3*(X$7*$AU92^(-6*X$4-6))*$D92^3+4*(X$8*$AU92^(-8*X$4-12))*$D92^4+5*(X$9*$AU92^(-10*X$4-20))*$D92^5+6*(X$10*$AU92^(-12*X$4-30))*$D92^6)/O92)","v":0.97291930545383987},{"$f":"IF($A92=\"\",\"\",((Y$5*$AU92^(-2*Y$4))*$D92+2*(Y$6*$AU92^(-4*Y$4-2))*$D92^2+3*(Y$7*$AU92^(-6*Y$4-6))*$D92^3+4*(Y$8*$AU92^(-8*Y$4-12))*$D92^4+5*(Y$9*$AU92^(-10*Y$4-20))*$D92^5+6*(Y$10*$AU92^(-12*Y$4-30))*$D92^6)/P92)","v":5.3488481511860561E-6},{"$f":"IF($A92=\"\",\"\",((Z$5*$AU92^(-2*Z$4))*$D92+2*(Z$6*$AU92^(-4*Z$4-2))*$D92^2+3*(Z$7*$AU92^(-6*Z$4-6))*$D92^3+4*(Z$8*$AU92^(-8*Z$4-12))*$D92^4+5*(Z$9*$AU92^(-10*Z$4-20))*$D92^5+6*(Z$10*$AU92^(-12*Z$4-30))*$D92^6)/Q92)","v":0.20867957548038021},{"$f":"IF($A92=\"\",\"\",((AA$5*$AU92^(-2*AA$4))*$D92+2*(AA$6*$AU92^(-4*AA$4-2))*$D92^2+3*(AA$7*$AU92^(-6*AA$4-6))*$D92^3+4*(AA$8*$AU92^(-8*AA$4-12))*$D92^4+5*(AA$9*$AU92^(-10*AA$4-20))*$D92^5+6*(AA$10*$AU92^(-12*AA$4-30))*$D92^6)/R92)","v":0.55429533878446668},{"$f":"IF($A92=\"\",\"\",((AB$5*$AU92^(-2*AB$4))*$D92+2*(AB$6*$AU92^(-4*AB$4-2))*$D92^2+3*(AB$7*$AU92^(-6*AB$4-6))*$D92^3+4*(AB$8*$AU92^(-8*AB$4-12))*$D92^4+5*(AB$9*$AU92^(-10*AB$4-20))*$D92^5+6*(AB$10*$AU92^(-12*AB$4-30))*$D92^6)/S92)","v":9.3597142890023193E-18},{"$f":"IF($A92=\"\",\"\",((AC$5*$AU92^(-2*AC$4))*$D92+2*(AC$6*$AU92^(-4*AC$4-2))*$D92^2)/T92)","v":9.3597142890023193E-18},{"$f":"IF($A92=\"\",\"\",((AD$5*$AU92^(-2*AD$4))*$D92+2*(AD$6*$AU92^(-4*AD$4-2))*$D92^2)/U92)","v":0.99999807807439167},{"$f":"IF($A92=\"\",\"\",((AE$5*$AU92^(-2*AE$4))*$D92+2*(AE$6*$AU92^(-4*AE$4-2))*$D92^2)/V92)","v":0.55429533878446668},{"$f":"IF(B$11=0,\"\",IF($A92=\"\",\"\",0.5*B$11*$L92*(1*V$4^2+(V$5*$AU92^(-2*V$4))*$D92*(V$4+1)^2+(V$6*$AU92^(-4*V$4-2))*$D92^2*(V$4+2)^2+(V$7*$AU92^(-6*V$4-6))*$D92^3*(V$4+3)^2+(V$8*$AU92^(-8*V$4-12))*$D92^4*(V$4+4)^2+(V$9*$AU92^(-10*V$4-20))*$D92^5*(V$4+5)^2+(V$10*$AU92^(-12*V$4-30))*$D92^6*(V$4+6)^2)/M92))","v":5.7035665053017E-2},{"$f":"IF(C$11=0,\"\",IF($A92=\"\",\"\",0.5*C$11*$L92*(1*W$4^2+(W$5*$AU92^(-2*W$4))*$D92*(W$4+1)^2+(W$6*$AU92^(-4*W$4-2))*$D92^2*(W$4+2)^2+(W$7*$AU92^(-6*W$4-6))*$D92^3*(W$4+3)^2+(W$8*$AU92^(-8*W$4-12))*$D92^4*(W$4+4)^2+(W$9*$AU92^(-10*W$4-20))*$D92^5*(W$4+5)^2+(W$10*$AU92^(-12*W$4-30))*$D92^6*(W$4+6)^2)/N92))","v":5.7007461192185973E-3},{"$f":"IF(D$11=0,\"\",IF($A92=\"\",\"\",0.5*D$11*$L92*(1*X$4^2+(X$5*$AU92^(-2*X$4))*$D92*(X$4+1)^2+(X$6*$AU92^(-4*X$4-2))*$D92^2*(X$4+2)^2+(X$7*$AU92^(-6*X$4-6))*$D92^3*(X$4+3)^2+(X$8*$AU92^(-8*X$4-12))*$D92^4*(X$4+4)^2+(X$9*$AU92^(-10*X$4-20))*$D92^5*(X$4+5)^2+(X$10*$AU92^(-12*X$4-30))*$D92^6*(X$4+6)^2)/O92))","v":""},{"$f":"IF(E$11=0,\"\",IF($A92=\"\",\"\",0.5*E$11*$L92*(1*Y$4^2+(Y$5*$AU92^(-2*Y$4))*$D92*(Y$4+1)^2+(Y$6*$AU92^(-4*Y$4-2))*$D92^2*(Y$4+2)^2+(Y$7*$AU92^(-6*Y$4-6))*$D92^3*(Y$4+3)^2+(Y$8*$AU92^(-8*Y$4-12))*$D92^4*(Y$4+4)^2+(Y$9*$AU92^(-10*Y$4-20))*$D92^5*(Y$4+5)^2+(Y$10*$AU92^(-12*Y$4-30))*$D92^6*(Y$4+6)^2)/P92))","v":""},{"$f":"IF(F$11=0,\"\",IF($A92=\"\",\"\",0.5*F$11*$L92*(1*Z$4^2+(Z$5*$AU92^(-2*Z$4))*$D92*(Z$4+1)^2+(Z$6*$AU92^(-4*Z$4-2))*$D92^2*(Z$4+2)^2+(Z$7*$AU92^(-6*Z$4-6))*$D92^3*(Z$4+3)^2+(Z$8*$AU92^(-8*Z$4-12))*$D92^4*(Z$4+4)^2+(Z$9*$AU92^(-10*Z$4-20))*$D92^5*(Z$4+5)^2+(Z$10*$AU92^(-12*Z$4-30))*$D92^6*(Z$4+6)^2)/Q92))","v":""},{"$f":"IF(G$11=0,\"\",IF($A92=\"\",\"\",0.5*G$11*$L92*(1*AA$4^2+(AA$5*$AU92^(-2*AA$4))*$D92*(AA$4+1)^2+(AA$6*$AU92^(-4*AA$4-2))*$D92^2*(AA$4+2)^2+(AA$7*$AU92^(-6*AA$4-6))*$D92^3*(AA$4+3)^2+(AA$8*$AU92^(-8*AA$4-12))*$D92^4*(AA$4+4)^2+(AA$9*$AU92^(-10*AA$4-20))*$D92^5*(AA$4+5)^2+(AA$10*$AU92^(-12*AA$4-30))*$D92^6*(AA$4+6)^2)/R92))","v":""},{"$f":"IF(H$11=0,\"\",IF($A92=\"\",\"\",0.5*H$11*$L92*(1*AB$4^2+(AB$5*$AU92^(-2*AB$4))*$D92*(AB$4+1)^2+(AB$6*$AU92^(-4*AB$4-2))*$D92^2*(AB$4+2)^2+(AB$7*$AU92^(-6*AB$4-6))*$D92^3*(AB$4+3)^2+(AB$8*$AU92^(-8*AB$4-12))*$D92^4*(AB$4+4)^2+(AB$9*$AU92^(-10*AB$4-20))*$D92^5*(AB$4+5)^2+(AB$10*$AU92^(-12*AB$4-30))*$D92^6*(AB$4+6)^2)/S92))","v":""},{"$f":"IF(B$18=0,\"\",IF($A92=\"\",\"\",0.5*B$18*$K92*(1*AC$4^2+(AC$5*$AU92^(-2*AC$4))*$D92*(AC$4+1)^2+(AC$6*$AU92^(-4*AC$4-2))*$D92^2*(AC$4+2)^2)/T92))","v":""},{"$f":"IF(C$18=0,\"\",IF($A92=\"\",\"\",0.5*C$18*$K92*(1*AD$4^2+(AD$5*$AU92^(-2*AD$4))*$D92*(AD$4+1)^2+(AD$6*$AU92^(-4*AD$4-2))*$D92^2*(AD$4+2)^2)/U92))","v":4.7349210022991952E-8},{"$f":"IF(D$18=0,\"\",IF($A92=\"\",\"\",0.5*D$18*$K92*(1*AE$4^2+(AE$5*$AU92^(-2*AE$4))*$D92*(AE$4+1)^2+(AE$6*$AU92^(-4*AE$4-2))*$D92^2*(AE$4+2)^2)/V92))","v":""},8.7778643482577745E-2,8.7778643482577745E-2,null,8.7778643482577745E-2,0.78898275584625743,null,-2.7481383537162785E-2]
[19.933300970296841,10.031987109556535,10.034309864044189,1.1774703282959727E-10,0.29222654407881288,2.3227544876540662E-3,4.269235063673871E-10,-2.0662127343702708E-5,5.5126479125254459E-2,5.5147141252598161E-2,0.49916486956897488,0.50083513043102512,1.0000706852219319,1.4396183586117026,29.132093149132757,1.0000041886667468,1.2065142250295524,1.9733594090907622,1,1,407452.39492586959,1.9733594090907622,7.0680411878264101E-5,0.30537146707694834,0.96567448701647496,4.1886492019259824E-6,0.17116600927311404,0.49333123586272615,7.3295246366097352E-18,7.3295246366097352E-18,0.99999754572555599,0.49333123586272615,5.6312405019610608E-2,6.1044678833490993E-3,"","","","","","",6.1254379135480497E-8,"",8.7791455167843285E-2,8.7791455167843285E-2,null,8.7791455167843285E-2,0.78897441220748254,null,2.3227544876540662E-3]
[20.389101548062172,10.202887247648615,10.170055866241455,7.9459893797157368E-11,0.29745563918420004,-3.283138140715991E-2,6.3188810234652343E-8,2.513738455660261E-4,5.4504363750750295E-2,5.4252989905184269E-2,0.50481691264658546,0.49518308735341454,1.000047636229985,1.2965360731566342,19.967379730171171,1.0000028253842796,1.1393631584092514,1.6562289058467783,1,1,274839.47142030596,1.6562289058467783,4.763404539576792E-5,0.22871409795001263,0.94991890733748352,2.8253762969486465E-6,0.12231671471967423,0.39626277713841385,4.9439893259652216E-18,4.9439893259652216E-18,0.99999636151243187,0.39626277713841385,5.5677619078545501E-2,6.7016478166965834E-3,"","","","","","",9.1838503042850804E-8,"",8.8065703030936388E-2,8.8065703030936388E-2,null,8.8065703030936388E-2,0.78879613162325657,null,-3.283138140715991E-2]
[20.788013354467694,10.290634401448534,10.3057541847229,6.4920211132189452E-11,0.29469540398881311,1.5119783274366583E-2,1.0386617981989922E-8,-1.0191475841108549E-4,5.3971304344011282E-2,5.4073219102422368E-2,0.50965986437754973,0.49034013562245021,1.0000389309142856,1.2422988092516281,16.499684011360436,1.0000023086137264,1.1138622924801975,1.5362435479014354,1,1,224570.75931985417,1.5362435479014354,3.8929455170359458E-5,0.19504068664375476,0.93939325646288285,2.3086083967864656E-6,0.10222295273741999,0.34909325730887769,4.0397200845801059E-18,4.0397200845801059E-18,0.99999554706052107,0.34909325730887769,5.5133351713733403E-2,6.9258291763381373E-3,"","","","","","",1.1347422654693117E-7,"",8.8007220073165068E-2,8.8007220073165068E-2,null,8.8007220073165068E-2,0.78883409785051062,null,1.5119783274366583E-2]
[21.132498390215915,10.417895616528499,10.441256999969482,4.8433803053320036E-11,0.41285066378909513,2.3361383440983374E-2,1.8304170131275847E-8,-1.3529290495541829E-4,5.3519294195492138E-2,5.3654587100447557E-2,0.51376646732556974,0.48623353267443026,1.0000290324651322,1.1807424646710034,12.560376653383384,1.0000017221072515,1.084947102805262,1.3999459028887573,1,1,167518.50479178483,1.3999459028887573,2.9031653666196797E-5,0.15307526580840913,0.92038490230303971,1.7221042858260684E-6,7.8296077832385513E-2,0.28570604476765205,3.0134236714491858E-18,3.0134236714491858E-18,0.99999403051023383,0.28570604476765205,5.4671910041547672E-2,7.2258696789731149E-3,"","","","","","",1.5334618344527067E-7,"",8.8090784295430921E-2,8.8090784295430921E-2,null,8.8090784295430921E-2,0.78877985785120197,null,2.3361383440983374E-2]
[21.431539957120549,10.55434135139315,10.576706409454346,3.5378345183566822E-11,0.5651745376220052,2.2365058061195597E-2,1.2616714397539582E-8,-1.1232414877282437E-4,5.3133006511944435E-2,5.3245330660717259E-2,0.5172759684844217,0.48272403151557824,1.000021196524606,1.1320017794218509,9.4415494673623588,1.0000012577078807,1.0620493898048853,1.2920408106115162,1,1,122344.1849383276,1.2920408106115162,2.1196092059947842E-5,0.11660916340144988,0.8940854290273329,1.2577062989858987E-6,5.8424203620402855E-2,0.22604182675310222,2.2007959704979575E-18,2.2007959704979575E-18,0.99999182633812544,0.22604182675310222,5.4277539368474265E-2,7.4825945104450512E-3,"","","","","","",2.1140194311040408E-7,"",8.8187926853061663E-2,8.8187926853061663E-2,null,8.8187926853061663E-2,0.78871687633566678,null,2.2365058061195597E-2]
[21.698694249789696,10.734422648245941,10.712281703948975,2.3373341543507887E-11,0.60234526427762458,-2.2140944296966225E-2,9.8284571444963154E-9,9.9138575461302225E-5,5.2792595114718129E-2,5.2693456539256826E-2,0.52036867437159939,0.47963132562840066,1.0000139913722255,1.0871834198319479,6.5737446786407085,1.0000008306802755,1.0409940479960464,1.1928240448322196,1,1,80805.193181632305,1.1928240448322196,1.3991183764372802E-5,8.0192006884747924E-2,0.84787985707834623,8.306795854476351E-7,3.9379714105917903E-2,0.16165866973846024,1.4535631293489324E-18,1.4535631293489324E-18,0.99998762455777124,0.16165866973846024,5.3930011071558023E-2,7.7411435284558761E-3,"","","","","","",3.2198962336611527E-7,"",8.8369148373118572E-2,8.8369148373118572E-2,null,8.8369148373118572E-2,0.78859958919554707,null,-2.2140944296966225E-2]
[21.950749414099846,10.868167724032876,10.84832239151001,1.7179022593678211E-11,0.48644457655932849,-1.9845332522866244E-2,7.4462096005264268E-9,8.6291422520007321E-5,5.2475398248825501E-2,5.2389106826305494E-2,0.52325047158089855,0.47674952841910151,1.0000102802000941,1.064071678690079,5.0957534870241359,1.0000006104724943,1.0301299527677512,1.1416916263291692,1,1,59384.542415560609,1.1416916263291692,1.0280098351101416E-5,6.0213686934481453E-2,0.80375827603535044,6.1047212176037248E-7,2.9248691086787824E-2,0.12410972204945973,1.0682332728867251E-18,1.0682332728867251E-18,0.99998316060107018,0.12410972204945973,5.3606090723248706E-2,7.8617601173693007E-3,"","","","","","",4.405611715581651E-7,"",8.8432993335322896E-2,8.8432993335322896E-2,null,8.8432993335322896E-2,0.78855833235604456,null,-1.9845332522866244E-2]
[22.207322194299195,10.981642393549766,10.984983921051025,1.3229117048815788E-11,0.44805216469906783,3.3415275012593781E-3,2.3039656099039416E-10,-1.517881948605998E-5,5.2156407179958592E-2,5.2171585999444652E-2,0.52614856948443567,0.47385143051556428,1.0000079157391017,1.0493383197436379,4.1538271947873389,1.0000004700936165,1.0232022904485005,1.109105308924599,1,1,45729.226038399502,1.109105308924599,7.9156787784827886E-6,4.7018505815944696E-2,0.75925823908842993,4.7009339553095707E-7,2.2676151788450515E-2,9.8374181888952111E-2,8.2259175820914036E-19,8.2259175820914036E-19,0.99997813214684284,9.8374181888952111E-2,5.3280296310508422E-2,7.9236824713795877E-3,"","","","","","",5.7528698281775093E-7,"",8.8452890761821057E-2,8.8452890761821057E-2,null,8.8452890761821057E-2,0.78854548135405089,null,3.3415275012593781E-3]
[22.491481258475687,11.110603281563485,11.122183322906494,9.8308159194041215E-12,0.46524593977633544,1.1580041343009384E-2,3.5285709775006942E-9,-5.9401775878341334E-5,5.1807614541619855E-2,5.1867016317498196E-2,0.52931742062979648,0.47068257937020358,1.0000058807482151,1.0366609634261807,3.3432477837026111,1.0000003493042524,1.0172420763582384,1.0810632761521084,1,1,33979.474182422469,1.0810632761521084,5.8807149209872925E-6,3.53644680375549E-2,0.7008897083357728,3.4930413043658152E-7,1.6949826161306362E-2,7.4985796198504193E-2,6.1122888947215485E-19,6.1122888947215485E-19,0.99997057046867088,7.4985796198504193E-2,5.2924047568162713E-2,7.966944283117873E-3,"","","","","","",7.7887818067474932E-7,"",8.8507996911473499E-2,8.8507996911473499E-2,null,8.8507996911473499E-2,0.78850990717285563,null,1.1580041343009384E-2]
[22.831461780879181,11.272657863965625,11.259646892547607,6.7700601222403385E-12,0.40731953756749351,-1.3010971418017547E-2,6.8306324888846095E-9,8.2647640552435675E-5,5.1396384592325858E-2,5.1313736951773423E-2,0.53305352728053756,0.46694647271946249,1.0000040465997859,1.0252401392873296,2.6128389037859034,1.0000002404870785,1.0118738764446937,1.0557949737944163,1,1,23394.313802290115,1.0557949737944163,4.0465840215744381E-6,2.4618758433638043E-2,0.61727456173941153,2.404870207253916E-7,1.173454194352133E-2,5.2846909900712856E-2,4.2081551807421138E-19,4.2081551807421138E-19,0.99995725457012963,5.2846909900712856E-2,5.2504009280364465E-2,7.9917501589271012E-3,"","","","","","",1.1392801083747878E-6,"",8.8670047948604364E-2,8.8670047948604364E-2,null,8.8670047948604364E-2,0.78840543688237863,null,-1.3010971418017547E-2]
[23.263700974348467,11.418746344965863,11.397158145904541,4.8368323776444825E-12,0.2786025783046992,-2.1588199061321589E-2,3.1323715914603672E-8,1.769850725756375E-4,5.0882893343932749E-2,5.0705908271357111E-2,0.53771869836428876,0.46228130163571129,1.0000028887954542,1.0180279470378015,2.1516792060259391,1.0000001717695877,1.0084832259978276,1.0398413866169092,1,1,16709.838950844871,1.0398413866169092,2.8887874201065236E-6,1.7708695630389532E-2,0.53524672561766051,1.717695581376038E-7,8.41186623548844E-3,3.8315128110281781E-2,3.0057044414246174E-19,3.0057044414246174E-19,0.99994015501867239,3.8315128110281781E-2,5.1979485404179661E-2,7.9679578337802856E-3,"","","","","","",1.6089882731547841E-6,"",8.8830851555667861E-2,8.8830851555667861E-2,null,8.8830851555667861E-2,0.78830198116101491,null,-2.1588199061321589E-2]
[23.837788712990005,11.544600449625474,11.534583568572998,3.6203181383588043E-12,0.21877131435016478,-1.0016881052475668E-2,1.1464252273503327E-8,1.0707124858477801E-4,5.0216544834280369E-2,5.0109473585695591E-2,0.54377260835527486,0.45622739164472509,1.0000021610442331,1.0134912554315636,1.8617037942606611,1.0000001285441642,1.0063496053933316,1.0298098774046929,1,1,12505.097878667289,1.0298098774046929,2.1610397373855768E-6,1.3311664378153206E-2,0.4628576368154329,1.285441476027866E-7,6.3095422895801971E-3,2.8947118164131629E-2,2.2493257993858353E-19,2.2493257993858353E-19,0.9999200326131229,2.8947118164131629E-2,5.1298796963987169E-2,7.8988115187230441E-3,"","","","","","",2.1742037272771296E-6,"",8.8943338165500929E-2,8.8943338165500929E-2,null,8.8943338165500929E-2,0.78822973522389939,null,-1.0016881052475668E-2]
[24.624625903379638,11.716381262755226,11.671737194061279,2.438560195221045E-12,0.16594882740251107,-4.4644068693946437E-2,4.4296378150575617E-7,6.6555524301575159E-4,4.9331108951097137E-2,4.8665553708081385E-2,0.55181697112030459,0.44818302887969541,1.0000014522622367,1.0090803793886496,1.5795281226545288,1.0000000865175065,1.0042769431789655,1.0200482276982039,1,1,8416.9664204050732,1.0200482276982039,1.4522602062717493E-6,8.9986680735068651E-3,0.36689953498637834,8.6517498961337184E-8,4.2587288377121122E-3,1.965426282379246E-2,1.5139237216367313E-19,1.5139237216367313E-19,0.99988119235006379,1.965426282379246E-2,5.0394298271990781E-2,7.7934552434014192E-3,"","","","","","",3.278003876684992E-6,"",8.9418494875938739E-2,8.9418494875938739E-2,null,8.9418494875938739E-2,0.78792568280133068,null,-4.4644068693946437E-2]
[25.730517484771553,11.841987918362173,11.808842182159424,1.8264963472613393E-12,8.3911350979676058E-2,{"$f":"IF(A106=\"\",\"\",IF(C106=\"\",\"0,00001\",(IF(ABS(C106-B106)<0.00001,0.00001,C106-B106))))","v":-3.3145736202749632E-2},{"$f":"IF(A106=\"\",\"\",IF(AX106=\"X\",0,IF(ABS(E106)<0.00001,(0.00001^M$20)*(ABS(H106)^I$20)*ABS(F106)^K$20,((ABS(E106))^M$20)*((ABS(H106))^I$20)*ABS(F106)^K$20)))","v":4.3772864374574003E-7},{"$f":"IF(A106=\"\",\"\",I106-J106)","v":6.6161064361582034E-4},4.8138145016063762E-2,4.7476534372447941E-2,0.56265528797787867,0.43734471202212133,1.000001086371759,1.0067983787371535,1.4337024831423495,1.0000000647746918,1.0032034563301468,1.01500351475089,1,1,6301.9401616454315,1.01500351475089,1.0863706230022185E-6,6.7524728719376165E-3,0.30250522296679117,6.4774687601151286E-8,3.1932269670058109E-3,1.4781774427216588E-2,1.1334577994750903E-19,1.1334577994750903E-19,0.99984131870910387,1.4781774427216588E-2,4.9175633447043794E-2,7.6222251387414791E-3,"","","","","","",4.4641433712928964E-6,"",{"$f":"IF(A106=\"\",\"\",SUM(AG106:AP106)+0.5*(D106+ $AC$9/AU106^2/D106)+$L106*$S$16+$K106*$T$16)","v":8.9680468272602121E-2},{"$f":"IF(A106=\"\",\"\",AQ106+$L106*S$14+$K106*$T$14)","v":8.9680468272602121E-2},null,8.9680468272602121E-2,{"$f":"IF(A106=\"\",\"\",10^(-$P$16*($AT106^0.5/(1+$AT106^0.5)-$P$17*$AT106)))","v":0.7877588186291361},null,{"$f":"IF(C106=\"\",\"\",C106-B106)","v":-3.3145736202749632E-2}]
[27.32318145717727,11.928379050320729,11.946029186248779,1.4967795428608688E-12,{"$f":"IF(A107=\"\",\"\",IF(A108=\"\",(B107-B106)/(A107-A106),((B108-B107)/(A108-A107)+(B107-B106)/(A107-A106))/2))","v":5.2419871386658483E-2},1.7650135928050759E-2,2.0540867529648281E-7,-4.532203385732847E-4,4.6518053405466886E-2,4.6971273744040171E-2,0.57737414552109112,0.42262585447890888,1.0000008911206719,1.0055729360647785,1.3556397426247027,1.000000053098721,1.0026251724557793,1.0123030046950141,1,1,5166.1633468922573,1.0123030046950141,8.911199073016794E-7,5.542050573134079E-3,0.26234089751318845,5.3098718211433301E-8,2.618298969443723E-3,1.2153505766055743E-2,9.2914621166137843E-20,9.2914621166137843E-20,0.99980643275621517,1.2153505766055743E-2,4.7520630267557776E-2,7.3746749988713193E-3,"","","","","","",5.5880360990561272E-6,"",8.9481494339745976E-2,8.9481494339745976E-2,null,8.9481494339745976E-2,0.7878855052735465,null,1.7650135928050759E-2]
[29.683852127345745,12.047820911462628,12.083085536956787,1.1369838987893738E-12,4.9922325274648377E-2,3.5264625494159318E-2,1.4711418864495908E-6,-1.2129063799195677E-3,4.430780199367719E-2,4.5520708373596758E-2,0.59745472334275584,0.40254527665724416,1.0000006765547842,1.0042325672054859,1.2700557411161966,1.000000040327738,1.0019941338909948,1.009342306250151,1,1,3923.8695145032766,1.009342306250151,6.7655434359850584E-7,4.2147280866836239E-3,0.21263298513024756,4.0327736337002227E-8,1.9901652350508147E-3,9.25585009113024E-3,7.0567358734853561E-20,7.0567358734853561E-20,0.99974514952744886,9.25585009113024E-3,4.5262747973211774E-2,7.033651299034915E-3,"","","","","","",7.6130809285892853E-6,"",8.9590662876239943E-2,8.9590662876239943E-2,null,8.9590662876239943E-2,0.78781595866175214,null,3.5264625494159318E-2]
[33.322947287524585,12.227039328612095,12.219712734222412,7.5342970493168977E-13,3.4173523934599687E-2,-7.3265943896831942E-3,1.3111026024939451E-7,3.6209150811555152E-4,4.1283957364011026E-2,4.0921865855895474E-2,0.62492695889150163,0.37507304110849837,1.0000004451950648,1.0027981990449613,1.1781207321685652,1.0000000266611331,1.0013214256689882,1.0061619039556076,1,1,2594.4543261840922,1.0061619039556076,4.4519487415157869E-7,2.7903909760687634E-3,0.15119055997499209,2.6661132446822627E-8,1.3196818075726588E-3,6.1241738499025243E-3,4.6652895570875046E-20,4.6652895570875046E-20,0.99961456249589453,6.1241738499025243E-3,4.2173737211132462E-2,6.5630045388346851E-3,"","","","","","",1.2043514364167676E-5,"",9.1047176596205842E-2,9.1047176596205842E-2,null,9.1047176596205842E-2,0.78689707786880048,null,-7.3265943896831942E-3]
[39.274074586865027,12.340699770716011,12.356882572174072,5.80032196389088E-13,1.7176237787837535E-2,1.6182801458061391E-2,1.1382940808109204E-6,-1.0669086562639374E-3,3.7139040932903787E-2,3.8205949589167724E-2,0.66258435683056716,0.3374156431694329,1.0000003424056136,1.0021535172635148,1.1370391373234385,1.0000000205186299,1.0010173071596873,1.0047407271971069,1,1,1996.944024728585,1.0047407271971069,3.4240550076264225E-7,2.1488895929585895E-3,0.12052279771605429,2.0518629454677212E-8,1.0162732975854396E-3,4.7183625555991555E-3,3.5904456543093538E-20,3.5904456543093538E-20,0.99949923483702263,4.7183625555991555E-3,3.7939488896639499E-2,5.9078758247111882E-3,"","","","","","",1.6589958171727484E-5,"",9.1249719757936887E-2,9.1249719757936887E-2,null,9.1249719757936831E-2,0.7867706097897279,null,1.6182801458061391E-2]
[49.999999995634425,12.504307661022999,12.49352502822876,3.9867959482785319E-13,1.5253498795845061E-2,-1.0782632794239078E-2,1.0116718905409189E-6,1.005819014803816E-3,3.1448318321126607E-2,3.0442499306322791E-2,0.71428571426789567,0.28571428573210439,1.0000002328273507,1.0014748935275841,1.0935184569954612,1.000000014052729,1.0006992363678509,1.003235173462008,1,1,1367.9753075521373,1.003235173462008,2.3282729859484863E-7,1.4727214204248581E-3,8.5520693945960263E-2,1.4052728755521291E-8,6.9874777799241777E-4,3.2247426493633808E-3,2.4590121224547742E-20,2.4590121224547742E-20,0.99926899265324498,3.2247426493633808E-3,3.2126117595551888E-2,5.0060166487325185E-3,"","","","","","",2.6107405240597602E-5,"",9.3545128095830973E-2,9.3545128095830973E-2,null,9.3545128095829877E-2,0.78535919124542264,null,-1.0782632794239078E-2]
[null,null,null,{"$f":"IF(A112=\"\",\"\",10^-((((B112-P$12)/P$13)+7))/$AU112)","v":""},{"$f":"IF(A112=\"\",\"\",IF(A113=\"\",(B112-B111)/(A112-A111),((B113-B112)/(A113-A112)+(B112-B111)/(A112-A111))/2))","v":""},{"$f":"IF(A112=\"\",\"\",IF(C112=\"\",\"0,00001\",(IF(ABS(C112-B112)<0.00001,0.00001,C112-B112))))","v":""},{"$f":"IF(A112=\"\",\"\",IF(AX112=\"X\",0,IF(ABS(E112)<0.00001,(0.00001^M$20)*(ABS(H112)^I$20)*ABS(F112)^K$20,((ABS(E112))^M$20)*((ABS(H112))^I$20)*ABS(F112)^K$20)))","v":""},"",{"$f":"IF(A112=\"\",\"\",L112*I$18+K112*E$19)","v":""},{"$f":"IF(A112=\"\",\"\",D112 -$AC$9/AU112^2/D112+L112*(W112*$B$11+X112*$C$11+Y112*$D$11+Z112*$E$11+AA112*$F$11+AB112*$G$11+AC112*$H$11)+K112*(AD112*$B$18+AE112*$C$18+AF112*$D$18))","v":""},{"$f":"IF(A112=\"\",\"\",A112/(A112+$G$16))","v":""},{"$f":"IF(A112=\"\",\"\",$E$16/(A112+$G$16))","v":""},{"$f":"IF($A112=\"\",\"\",(1+(V$5*$AU112^(-2*V$4))*$D112+(V$6*$AU112^(-4*V$4-2))*$D112^2+(V$7*$AU112^(-6*V$4-6))*$D112^3+(V$8*$AU112^(-8*V$4-12))*$D112^4+(V$9*$AU112^(-10*V$4-20))*$D112^5+(V$10*$AU112^(-12*V$4-30))*$D112^6))","v":""},{"$f":"IF($A112=\"\",\"\",(1+(W$5*$AU112^(-2*W$4))*$D112+(W$6*$AU112^(-4*W$4-2))*$D112^2+(W$7*$AU112^(-6*W$4-6))*$D112^3+(W$8*$AU112^(-8*W$4-12))*$D112^4+(W$9*$AU112^(-10*W$4-20))*$D112^5+(W$10*$AU112^(-12*W$4-30))*$D112^6))","v":""},{"$f":"IF($A112=\"\",\"\",(1+(X$5*$AU112^(-2*X$4))*$D112+(X$6*$AU112^(-4*X$4-2))*$D112^2+(X$7*$AU112^(-6*X$4-6))*$D112^3+(X$8*$AU112^(-8*X$4-12))*$D112^4+(X$9*$AU112^(-10*X$4-20))*$D112^5+(X$10*$AU112^(-12*X$4-30))*$D112^6))","v":""},{"$f":"IF($A112=\"\",\"\",(1+(Y$5*$AU112^(-2*Y$4))*$D112+(Y$6*$AU112^(-4*Y$4-2))*$D112^2+(Y$7*$AU112^(-6*Y$4-6))*$D112^3+(Y$8*$AU112^(-8*Y$4-12))*$D112^4+(Y$9*$AU112^(-10*Y$4-20))*$D112^5+(Y$10*$AU112^(-12*Y$4-30))*$D112^6))","v":""},{"$f":"IF($A112=\"\",\"\",(1+(Z$5*$AU112^(-2*Z$4))*$D112+(Z$6*$AU112^(-4*Z$4-2))*$D112^2+(Z$7*$AU112^(-6*Z$4-6))*$D112^3+(Z$8*$AU112^(-8*Z$4-12))*$D112^4+(Z$9*$AU112^(-10*Z$4-20))*$D112^5+(Z$10*$AU112^(-12*Z$4-30))*$D112^6))","v":""},{"$f":"IF($A112=\"\",\"\",(1+(AA$5*$AU112^(-2*AA$4))*$D112+(AA$6*$AU112^(-4*AA$4-2))*$D112^2+(AA$7*$AU112^(-6*AA$4-6))*$D112^3+(AA$8*$AU112^(-8*AA$4-12))*$D112^4+(AA$9*$AU112^(-10*AA$4-20))*$D112^5+(AA$10*$AU112^(-12*AA$4-30))*$D112^6))","v":""},{"$f":"IF($A112=\"\",\"\",(1+(AB$5*$AU112^(-2*AB$4))*$D112+(AB$6*$AU112^(-4*AB$4-2))*$D112^2+(AB$7*$AU112^(-6*AB$4-6))*$D112^3+(AB$8*$AU112^(-8*AB$4-12))*$D112^4+(AB$9*$AU112^(-10*AB$4-20))*$D112^5+(AB$10*$AU112^(-12*AB$4-30))*$D112^6))","v":""},{"$f":"IF($A112=\"\",\"\",(1+(AC$5*$AU112^(-2*AC$4))*$D112+(AC$6*$AU112^(-4*AC$4-2))*$D112^2))","v":""},{"$f":"IF($A112=\"\",\"\",(1+(AD$5*$AU112^(-2*AD$4))*$D112+(AD$6*$AU112^(-4*AD$4-2))*$D112^2))","v":""},{"$f":"IF($A112=\"\",\"\",(1+(AE$5*$AU112^(-2*AE$4))*$D112+(AE$6*$AU112^(-4*AE$4-2))*$D112^2))","v":""},{"$f":"IF($A112=\"\",\"\",((V$5*$AU112^(-2*V$4))*$D112+2*(V$6*$AU112^(-4*V$4-2))*$D112^2+3*(V$7*$AU112^(-6*V$4-6))*$D112^3+4*(V$8*$AU112^(-8*V$4-12))*$D112^4+5*(V$9*$AU112^(-10*V$4-20))*$D112^5+6*(V$10*$AU112^(-12*V$4-30))*$D112^6)/M112)","v":""},{"$f":"IF($A112=\"\",\"\",((W$5*$AU112^(-2*W$4))*$D112+2*(W$6*$AU112^(-4*W$4-2))*$D112^2+3*(W$7*$AU112^(-6*W$4-6))*$D112^3+4*(W$8*$AU112^(-8*W$4-12))*$D112^4+5*(W$9*$AU112^(-10*W$4-20))*$D112^5+6*(W$10*$AU112^(-12*W$4-30))*$D112^6)/N112)","v":""},{"$f":"IF($A112=\"\",\"\",((X$5*$AU112^(-2*X$4))*$D112+2*(X$6*$AU112^(-4*X$4-2))*$D112^2+3*(X$7*$AU112^(-6*X$4-6))*$D112^3+4*(X$8*$AU112^(-8*X$4-12))*$D112^4+5*(X$9*$AU112^(-10*X$4-20))*$D112^5+6*(X$10*$AU112^(-12*X$4-30))*$D112^6)/O112)","v":""},{"$f":"IF($A112=\"\",\"\",((Y$5*$AU112^(-2*Y$4))*$D112+2*(Y$6*$AU112^(-4*Y$4-2))*$D112^2+3*(Y$7*$AU112^(-6*Y$4-6))*$D112^3+4*(Y$8*$AU112^(-8*Y$4-12))*$D112^4+5*(Y$9*$AU112^(-10*Y$4-20))*$D112^5+6*(Y$10*$AU112^(-12*Y$4-30))*$D112^6)/P112)","v":""},{"$f":"IF($A112=\"\",\"\",((Z$5*$AU112^(-2*Z$4))*$D112+2*(Z$6*$AU112^(-4*Z$4-2))*$D112^2+3*(Z$7*$AU112^(-6*Z$4-6))*$D112^3+4*(Z$8*$AU112^(-8*Z$4-12))*$D112^4+5*(Z$9*$AU112^(-10*Z$4-20))*$D112^5+6*(Z$10*$AU112^(-12*Z$4-30))*$D112^6)/Q112)","v":""},{"$f":"IF($A112=\"\",\"\",((AA$5*$AU112^(-2*AA$4))*$D112+2*(AA$6*$AU112^(-4*AA$4-2))*$D112^2+3*(AA$7*$AU112^(-6*AA$4-6))*$D112^3+4*(AA$8*$AU112^(-8*AA$4-12))*$D112^4+5*(AA$9*$AU112^(-10*AA$4-20))*$D112^5+6*(AA$10*$AU112^(-12*AA$4-30))*$D112^6)/R112)","v":""},{"$f":"IF($A112=\"\",\"\",((AB$5*$AU112^(-2*AB$4))*$D112+2*(AB$6*$AU112^(-4*AB$4-2))*$D112^2+3*(AB$7*$AU112^(-6*AB$4-6))*$D112^3+4*(AB$8*$AU112^(-8*AB$4-12))*$D112^4+5*(AB$9*$AU112^(-10*AB$4-20))*$D112^5+6*(AB$10*$AU112^(-12*AB$4-30))*$D112^6)/S112)","v":""},{"$f":"IF($A112=\"\",\"\",((AC$5*$AU112^(-2*AC$4))*$D112+2*(AC$6*$AU112^(-4*AC$4-2))*$D112^2)/T112)","v":""},{"$f":"IF($A112=\"\",\"\",((AD$5*$AU112^(-2*AD$4))*$D112+2*(AD$6*$AU112^(-4*AD$4-2))*$D112^2)/U112)","v":""},{"$f":"IF($A112=\"\",\"\",((AE$5*$AU112^(-2*AE$4))*$D112+2*(AE$6*$AU112^(-4*AE$4-2))*$D112^2)/V112)","v":""},{"$f":"IF(B$11=0,\"\",IF($A112=\"\",\"\",0.5*B$11*$L112*(1*V$4^2+(V$5*$AU112^(-2*V$4))*$D112*(V$4+1)^2+(V$6*$AU112^(-4*V$4-2))*$D112^2*(V$4+2)^2+(V$7*$AU112^(-6*V$4-6))*$D112^3*(V$4+3)^2+(V$8*$AU112^(-8*V$4-12))*$D112^4*(V$4+4)^2+(V$9*$AU112^(-10*V$4-20))*$D112^5*(V$4+5)^2+(V$10*$AU112^(-12*V$4-30))*$D112^6*(V$4+6)^2)/M112))","v":""},{"$f":"IF(C$11=0,\"\",IF($A112=\"\",\"\",0.5*C$11*$L112*(1*W$4^2+(W$5*$AU112^(-2*W$4))*$D112*(W$4+1)^2+(W$6*$AU112^(-4*W$4-2))*$D112^2*(W$4+2)^2+(W$7*$AU112^(-6*W$4-6))*$D112^3*(W$4+3)^2+(W$8*$AU112^(-8*W$4-12))*$D112^4*(W$4+4)^2+(W$9*$AU112^(-10*W$4-20))*$D112^5*(W$4+5)^2+(W$10*$AU112^(-12*W$4-30))*$D112^6*(W$4+6)^2)/N112))","v":""},{"$f":"IF(D$11=0,\"\",IF($A112=\"\",\"\",0.5*D$11*$L112*(1*X$4^2+(X$5*$AU112^(-2*X$4))*$D112*(X$4+1)^2+(X$6*$AU112^(-4*X$4-2))*$D112^2*(X$4+2)^2+(X$7*$AU112^(-6*X$4-6))*$D112^3*(X$4+3)^2+(X$8*$AU112^(-8*X$4-12))*$D112^4*(X$4+4)^2+(X$9*$AU112^(-10*X$4-20))*$D112^5*(X$4+5)^2+(X$10*$AU112^(-12*X$4-30))*$D112^6*(X$4+6)^2)/O112))","v":""},{"$f":"IF(E$11=0,\"\",IF($A112=\"\",\"\",0.5*E$11*$L112*(1*Y$4^2+(Y$5*$AU112^(-2*Y$4))*$D112*(Y$4+1)^2+(Y$6*$AU112^(-4*Y$4-2))*$D112^2*(Y$4+2)^2+(Y$7*$AU112^(-6*Y$4-6))*$D112^3*(Y$4+3)^2+(Y$8*$AU112^(-8*Y$4-12))*$D112^4*(Y$4+4)^2+(Y$9*$AU112^(-10*Y$4-20))*$D112^5*(Y$4+5)^2+(Y$10*$AU112^(-12*Y$4-30))*$D112^6*(Y$4+6)^2)/P112))","v":""},{"$f":"IF(F$11=0,\"\",IF($A112=\"\",\"\",0.5*F$11*$L112*(1*Z$4^2+(Z$5*$AU112^(-2*Z$4))*$D112*(Z$4+1)^2+(Z$6*$AU112^(-4*Z$4-2))*$D112^2*(Z$4+2)^2+(Z$7*$AU112^(-6*Z$4-6))*$D112^3*(Z$4+3)^2+(Z$8*$AU112^(-8*Z$4-12))*$D112^4*(Z$4+4)^2+(Z$9*$AU112^(-10*Z$4-20))*$D112^5*(Z$4+5)^2+(Z$10*$AU112^(-12*Z$4-30))*$D112^6*(Z$4+6)^2)/Q112))","v":""},{"$f":"IF(G$11=0,\"\",IF($A112=\"\",\"\",0.5*G$11*$L112*(1*AA$4^2+(AA$5*$AU112^(-2*AA$4))*$D112*(AA$4+1)^2+(AA$6*$AU112^(-4*AA$4-2))*$D112^2*(AA$4+2)^2+(AA$7*$AU112^(-6*AA$4-6))*$D112^3*(AA$4+3)^2+(AA$8*$AU112^(-8*AA$4-12))*$D112^4*(AA$4+4)^2+(AA$9*$AU112^(-10*AA$4-20))*$D112^5*(AA$4+5)^2+(AA$10*$AU112^(-12*AA$4-30))*$D112^6*(AA$4+6)^2)/R112))","v":""},{"$f":"IF(H$11=0,\"\",IF($A112=\"\",\"\",0.5*H$11*$L112*(1*AB$4^2+(AB$5*$AU112^(-2*AB$4))*$D112*(AB$4+1)^2+(AB$6*$AU112^(-4*AB$4-2))*$D112^2*(AB$4+2)^2+(AB$7*$AU112^(-6*AB$4-6))*$D112^3*(AB$4+3)^2+(AB$8*$AU112^(-8*AB$4-12))*$D112^4*(AB$4+4)^2+(AB$9*$AU112^(-10*AB$4-20))*$D112^5*(AB$4+5)^2+(AB$10*$AU112^(-12*AB$4-30))*$D112^6*(AB$4+6)^2)/S112))","v":""},{"$f":"IF(B$18=0,\"\",IF($A112=\"\",\"\",0.5*B$18*$K112*(1*AC$4^2+(AC$5*$AU112^(-2*AC$4))*$D112*(AC$4+1)^2+(AC$6*$AU112^(-4*AC$4-2))*$D112^2*(AC$4+2)^2)/T112))","v":""},{"$f":"IF(C$18=0,\"\",IF($A112=\"\",\"\",0.5*C$18*$K112*(1*AD$4^2+(AD$5*$AU112^(-2*AD$4))*$D112*(AD$4+1)^2+(AD$6*$AU112^(-4*AD$4-2))*$D112^2*(AD$4+2)^2)/U112))","v":""},{"$f":"IF(D$18=0,\"\",IF($A112=\"\",\"\",0.5*D$18*$K112*(1*AE$4^2+(AE$5*$AU112^(-2*AE$4))*$D112*(AE$4+1)^2+(AE$6*$AU112^(-4*AE$4-2))*$D112^2*(AE$4+2)^2)/V112))","v":""},{"$f":"IF(A112=\"\",\"\",SUM(AG112:AP112)+0.5*(D112+ $AC$9/AU112^2/D112)+$L112*$S$16+$K112*$T$16)","v":""},{"$f":"IF(A112=\"\",\"\",AQ112+$L112*S$14+$K112*$T$14)","v":""},null,null,{"$f":"IF(A112=\"\",\"\",10^(-$P$16*($AT112^0.5/(1+$AT112^0.5)-$P$17*$AT112)))","v":""},null,{"$f":"IF(C112=\"\",\"\",C112-B112)","v":""}]
[null,null,null,"","","","","","","","","","","","","","","","","","","","","","","","","","","","","","","","","","","","","","","","","",null,null,"",null,""]
[null,null,null,"","","","","","","","","","","","","","","","","","","","","","","","","","","","","","","","","","","","","","","","","",null,null,"",null,""]
[null,null,null,"","","","","","","","","","","","","","","","","","","","","","","","","","","","","","","","","","","","","","","","","",null,null,"",null,""]
[null,null,null,"","","","","","","","","","","","","","","","","","","","","","","","","","","","","","","","","","","","","","","","","",null,null,"",null,""]
[null,null,null,"","","","","","","","","","","","","","","","","","","","","","","","","","","","","","","","","","","","","","","","","",null,null,"",null,""]
[null,null,null,"","","","","","","","","","","","","","","","","","","","","","","","","","","","","","","","","","","","","","","","","",null,null,"",null,""]
[null,null,null,"","","","","","","","","","","","","","","","","","","","","","","","","","","","","","","","","","","","","","","","","",null,null,"",null,""]
[null,null,null,"","","","","","","","","","","","","","","","","","","","","","","","","","","","","","","","","","","","","","","","","",null,null,"",null,""]
[null,null,null,"","","","","","","","","","","","","","","","","","","","","","","","","","","","","","","","","","","","","","","","","",null,null,"",null,""]
[null,null,null,"","","","","","","","","","","","","","","","","","","","","","","","","","","","","","","","","","","","","","","","","",null,null,"",null,""]
[null,null,null,"","","","","","","","","","","","","","","","","","","","","","","","","","","","","","","","","","","","","","","","","",null,null,"",null,""]
[null,null,null,"","","","","","","","","","","","","","","","","","","","","","","","","","","","","","","","","","","","","","","","","",null,null,"",null,""]
[null,null,null,"","","","","","","","","","","","","","","","","","","","","","","","","","","","","","","","","","","","","","","","","",null,null,"",null,""]
[null,null,null,"","","","","","","","","","","","","","","","","","","","","","","","","","","","","","","","","","","","","","","","","",null,null,"",null,""]
[null,null,null,"","","","","","","","","","","","","","","","","","","","","","","","","","","","","","","","","","","","","","","","","",null,null,"",null,""]
[null,null,null,"","","","","","","","","","","","","","","","","","","","","","","","","","","","","","","","","","","","","","","","","",null,null,"",null,""]
[null,null,null,"","","","","","","","","","","","","","","","","","","","","","","","","","","","","","","","","","","","","","","","","",null,null,"",null,""]
[null,null,null,"","","","","","","","","","","","","","","","","","","","","","","","","","","","","","","","","","","","","","","","","",null,null,"",null,""]
[null,null,null,"","","","","","","","","","","","","","","","","","","","","","","","","","","","","","","","","","","","","","","","","",null,null,"",null,""]
[null,null,null,"","","","","","","","","","","","","","","","","","","","","","","","","","","","","","","","","","","","","","","","","",null,null,"",null,""]
[null,null,null,"","","","","","","","","","","","","","","","","","","","","","","","","","","","","","","","","","","","","","","","","",null,null,"",null,""]
[null,null,null,"","","","","","","","","","","","","","","","","","","","","","","","","","","","","","","","","","","","","","","","","",null,null,"",null,""]
[null,null,null,"","","","","","","","","","","","","","","","","","","","","","","","","","","","","","","","","","","","","","","","","",null,null,"",null,""]
[null,null,null,"","","","","","","","","","","","","","","","","","","","","","","","","","","","","","","","","","","","","","","","","",null,null,"",null,""]
[null,null,null,"","","","","","","","","","","","","","","","","","","","","","","","","","","","","","","","","","","","","","","","","",null,null,"",null,""]
[null,null,null,"","","","","","","","","","","","","","","","","","","","","","","","","","","","","","","","","","","","","","","","","",null,null,"",null,""]
[null,null,null,"","","","","","","","","","","","","","","","","","","","","","","","","","","","","","","","","","","","","","","","","",null,null,"",null,""]
[null,null,null,"","","","","","","","","","","","","","","","","","","","","","","","","","","","","","","","","","","","","","","","","",null,null,"",null,""]
[null,null,null,"","","","","","","","","","","","","","","","","","","","","","","","","","","","","","","","","","","","","","","","","",null,null,"",null,""]
[null,null,null,"","","","","","","","","","","","","","","","","","","","","","","","","","","","","","","","","","","","","","","","","",null,null,"",null,""]
[null,null,null,"","","","","","","","","","","","","","","","","","","","","","","","","","","","","","","","","","","","","","","","","",null,null,"",null,""]
[null,null,null,"","","","","","","","","","","","","","","","","","","","","","","","","","","","","","","","","","","","","","","","","",null,null,"",null,""]
[null,null,null,"","","","","","","","","","","","","","","","","","","","","","","","","","","","","","","","","","","","","","","","","",null,null,"",null,""]
[null,null,null,"","","","","","","","","","","","","","","","","","","","","","","","","","","","","","","","","","","","","","","","","",null,null,"",null,""]
[null,null,null,"","","","","","","","","","","","","","","","","","","","","","","","","","","","","","","","","","","","","","","","","",null,null,"",null,""]
[null,null,null,"","","","","","","","","","","","","","","","","","","","","","","","","","","","","","","","","","","","","","","","","",null,null,"",null,""]
[null,null,null,"","","","","","","","","","","","","","","","","","","","","","","","","","","","","","","","","","","","","","","","","",null,null,"",null,""]
[null,null,null,"","","","","","","","","","","","","","","","","","","","","","","","","","","","","","","","","","","","","","","","","",null,null,"",null,""]
[null,null,null,"","","","","","","","","","","","","","","","","","","","","","","","","","","","","","","","","","","","","","","","","",null,null,"",null,""]
[null,null,null,"","","","","","","","","","","","","","","","","","","","","","","","","","","","","","","","","","","","","","","","","",null,null,"",null,""]
[null,null,null,"","","","","","","","","","","","","","","","","","","","","","","","","","","","","","","","","","","","","","","","","",null,null,"",null,""]
[null,null,null,"","","","","","","","","","","","","","","","","","","","","","","","","","","","","","","","","","","","","","","","","",null,null,"",null,""]
[null,null,null,"","","","","","","","","","","","","","","","","","","","","","","","","","","","","","","","","","","","","","","","","",null,null,"",null,""]
[null,null,null,"","","","","","","","","","","","","","","","","","","","","","","","","","","","","","","","","","","","","","","","","",null,null,"",null,""]
[null,null,null,"","","","","","","","","","","","","","","","","","","","","","","","","","","","","","","","","","","","","","","","","",null,null,"",null,""]
[null,null,null,"","","","","","","","","","","","","","","","","","","","","","","","","","","","","","","","","","","","","","","","","",null,null,"",null,""]
[null,null,null,"","","","","","","","","","","","","","","","","","","","","","","","","","","","","","","","","","","","","","","","","",null,null,"",null,""]
[null,null,null,"","","","","","","","","","","","","","","","","","","","","","","","","","","","","","","","","","","","","","","","","",null,null,"",null,""]
[null,null,null,"","","","","","","","","","","","","","","","","","","","","","","","","","","","","","","","","","","","","","","","","",null,null,"",null,""]
[null,null,null,"","","","","","","","","","","","","","","","","","","","","","","","","","","","","","","","","","","","","","","","","",null,null,"",null,""]
[null,null,null,"","","","","","","","","","","","","","","","","","","","","","","","","","","","","","","","","","","","","","","","","",null,null,"",null,""]
[null,null,null,"","","","","","","","","","","","","","","","","","","","","","","","","","","","","","","","","","","","","","","","","",null,null,"",null,""]
[null,null,null,"","","","","","","","","","","","","","","","","","","","","","","","","","","","","","","","","","","","","","","","","",null,null,"",null,""]
[null,null,null,"","","","","","","","","","","","","","","","","","","","","","","","","","","","","","","","","","","","","","","","","",null,null,"",null,""]
[null,null,null,"","","","","","","","","","","","","","","","","","","","","","","","","","","","","","","","","","","","","","","","","",null,null,"",null,""]
[null,null,null,"","","","","","","","","","","","","","","","","","","","","","","","","","","","","","","","","","","","","","","","","",null,null,"",null,""]
[null,null,null,"","","","","","","","","","","","","","","","","","","","","","","","","","","","","","","","","","","","","","","","","",null,null,"",null,""]
[null,null,null,"","","","",{"$f":"IF(A170=\"\",\"\",I170-J170)","v":""},"","","","","","","","","","","","","","","","","","","","","","","","","","","","","","","","","","","","",null,null,"",null,""]
[null,null,null,"","","","","","","","","","","","","","","","","","","","","","","","","","","","","","","","","","","","","","","","","",null,null,"",null,""]
[null,null,null,"","","","","","","","","","","","","","","","","","","","","","","","","","","","","","","","","","","","","","","","","",null,null,"",null,""]
[null,null,null,"","","","","","","","","","","","","","","","","","","","","","","","","","","","","","","","","","","","","","","","","",null,null,"",null,""]
[null,null,null,"","","","","","","","","","","","","","","","","","","","","","","","","","","","","","","","","","","","","","","","","",null,null,"",null,""]
[null,null,null,"","","","","","","","","","","","","","","","","","","","","","","","","","","","","","","","","","","","","","","","","",null,null,"",null,""]
[null,null,null,{"$f":"IF(A176=\"\",\"\",10^-((((B176-P$12)/P$13)+7))/$AU176)","v":""},{"$f":"IF(A176=\"\",\"\",IF(A177=\"\",(B176-B175)/(A176-A175),((B177-B176)/(A177-A176)+(B176-B175)/(A176-A175))/2))","v":""},{"$f":"IF(A176=\"\",\"\",IF(C176=\"\",\"0,00001\",(IF(ABS(C176-B176)<0.00001,0.00001,C176-B176))))","v":""},{"$f":"IF(A176=\"\",\"\",IF(AX176=\"X\",0,IF(ABS(E176)<0.00001,(0.00001^M$20)*(ABS(H176)^I$20)*ABS(F176)^K$20,((ABS(E176))^M$20)*((ABS(H176))^I$20)*ABS(F176)^K$20)))","v":""},"",{"$f":"IF(A176=\"\",\"\",L176*I$18+K176*E$19)","v":""},{"$f":"IF(A176=\"\",\"\",D176 -$AC$9/AU176^2/D176+L176*(W176*$B$11+X176*$C$11+Y176*$D$11+Z176*$E$11+AA176*$F$11+AB176*$G$11+AC176*$H$11)+K176*(AD176*$B$18+AE176*$C$18+AF176*$D$18))","v":""},{"$f":"IF(A176=\"\",\"\",A176/(A176+$G$16))","v":""},{"$f":"IF(A176=\"\",\"\",$E$16/(A176+$G$16))","v":""},{"$f":"IF($A176=\"\",\"\",(1+(V$5*$AU176^(-2*V$4))*$D176+(V$6*$AU176^(-4*V$4-2))*$D176^2+(V$7*$AU176^(-6*V$4-6))*$D176^3+(V$8*$AU176^(-8*V$4-12))*$D176^4+(V$9*$AU176^(-10*V$4-20))*$D176^5+(V$10*$AU176^(-12*V$4-30))*$D176^6))","v":""},{"$f":"IF($A176=\"\",\"\",(1+(W$5*$AU176^(-2*W$4))*$D176+(W$6*$AU176^(-4*W$4-2))*$D176^2+(W$7*$AU176^(-6*W$4-6))*$D176^3+(W$8*$AU176^(-8*W$4-12))*$D176^4+(W$9*$AU176^(-10*W$4-20))*$D176^5+(W$10*$AU176^(-12*W$4-30))*$D176^6))","v":""},{"$f":"IF($A176=\"\",\"\",(1+(X$5*$AU176^(-2*X$4))*$D176+(X$6*$AU176^(-4*X$4-2))*$D176^2+(X$7*$AU176^(-6*X$4-6))*$D176^3+(X$8*$AU176^(-8*X$4-12))*$D176^4+(X$9*$AU176^(-10*X$4-20))*$D176^5+(X$10*$AU176^(-12*X$4-30))*$D176^6))","v":""},{"$f":"IF($A176=\"\",\"\",(1+(Y$5*$AU176^(-2*Y$4))*$D176+(Y$6*$AU176^(-4*Y$4-2))*$D176^2+(Y$7*$AU176^(-6*Y$4-6))*$D176^3+(Y$8*$AU176^(-8*Y$4-12))*$D176^4+(Y$9*$AU176^(-10*Y$4-20))*$D176^5+(Y$10*$AU176^(-12*Y$4-30))*$D176^6))","v":""},{"$f":"IF($A176=\"\",\"\",(1+(Z$5*$AU176^(-2*Z$4))*$D176+(Z$6*$AU176^(-4*Z$4-2))*$D176^2+(Z$7*$AU176^(-6*Z$4-6))*$D176^3+(Z$8*$AU176^(-8*Z$4-12))*$D176^4+(Z$9*$AU176^(-10*Z$4-20))*$D176^5+(Z$10*$AU176^(-12*Z$4-30))*$D176^6))","v":""},{"$f":"IF($A176=\"\",\"\",(1+(AA$5*$AU176^(-2*AA$4))*$D176+(AA$6*$AU176^(-4*AA$4-2))*$D176^2+(AA$7*$AU176^(-6*AA$4-6))*$D176^3+(AA$8*$AU176^(-8*AA$4-12))*$D176^4+(AA$9*$AU176^(-10*AA$4-20))*$D176^5+(AA$10*$AU176^(-12*AA$4-30))*$D176^6))","v":""},{"$f":"IF($A176=\"\",\"\",(1+(AB$5*$AU176^(-2*AB$4))*$D176+(AB$6*$AU176^(-4*AB$4-2))*$D176^2+(AB$7*$AU176^(-6*AB$4-6))*$D176^3+(AB$8*$AU176^(-8*AB$4-12))*$D176^4+(AB$9*$AU176^(-10*AB$4-20))*$D176^5+(AB$10*$AU176^(-12*AB$4-30))*$D176^6))","v":""},{"$f":"IF($A176=\"\",\"\",(1+(AC$5*$AU176^(-2*AC$4))*$D176+(AC$6*$AU176^(-4*AC$4-2))*$D176^2))","v":""},{"$f":"IF($A176=\"\",\"\",(1+(AD$5*$AU176^(-2*AD$4))*$D176+(AD$6*$AU176^(-4*AD$4-2))*$D176^2))","v":""},{"$f":"IF($A176=\"\",\"\",(1+(AE$5*$AU176^(-2*AE$4))*$D176+(AE$6*$AU176^(-4*AE$4-2))*$D176^2))","v":""},{"$f":"IF($A176=\"\",\"\",((V$5*$AU176^(-2*V$4))*$D176+2*(V$6*$AU176^(-4*V$4-2))*$D176^2+3*(V$7*$AU176^(-6*V$4-6))*$D176^3+4*(V$8*$AU176^(-8*V$4-12))*$D176^4+5*(V$9*$AU176^(-10*V$4-20))*$D176^5+6*(V$10*$AU176^(-12*V$4-30))*$D176^6)/M176)","v":""},{"$f":"IF($A176=\"\",\"\",((W$5*$AU176^(-2*W$4))*$D176+2*(W$6*$AU176^(-4*W$4-2))*$D176^2+3*(W$7*$AU176^(-6*W$4-6))*$D176^3+4*(W$8*$AU176^(-8*W$4-12))*$D176^4+5*(W$9*$AU176^(-10*W$4-20))*$D176^5+6*(W$10*$AU176^(-12*W$4-30))*$D176^6)/N176)","v":""},{"$f":"IF($A176=\"\",\"\",((X$5*$AU176^(-2*X$4))*$D176+2*(X$6*$AU176^(-4*X$4-2))*$D176^2+3*(X$7*$AU176^(-6*X$4-6))*$D176^3+4*(X$8*$AU176^(-8*X$4-12))*$D176^4+5*(X$9*$AU176^(-10*X$4-20))*$D176^5+6*(X$10*$AU176^(-12*X$4-30))*$D176^6)/O176)","v":""},{"$f":"IF($A176=\"\",\"\",((Y$5*$AU176^(-2*Y$4))*$D176+2*(Y$6*$AU176^(-4*Y$4-2))*$D176^2+3*(Y$7*$AU176^(-6*Y$4-6))*$D176^3+4*(Y$8*$AU176^(-8*Y$4-12))*$D176^4+5*(Y$9*$AU176^(-10*Y$4-20))*$D176^5+6*(Y$10*$AU176^(-12*Y$4-30))*$D176^6)/P176)","v":""},{"$f":"IF($A176=\"\",\"\",((Z$5*$AU176^(-2*Z$4))*$D176+2*(Z$6*$AU176^(-4*Z$4-2))*$D176^2+3*(Z$7*$AU176^(-6*Z$4-6))*$D176^3+4*(Z$8*$AU176^(-8*Z$4-12))*$D176^4+5*(Z$9*$AU176^(-10*Z$4-20))*$D176^5+6*(Z$10*$AU176^(-12*Z$4-30))*$D176^6)/Q176)","v":""},{"$f":"IF($A176=\"\",\"\",((AA$5*$AU176^(-2*AA$4))*$D176+2*(AA$6*$AU176^(-4*AA$4-2))*$D176^2+3*(AA$7*$AU176^(-6*AA$4-6))*$D176^3+4*(AA$8*$AU176^(-8*AA$4-12))*$D176^4+5*(AA$9*$AU176^(-10*AA$4-20))*$D176^5+6*(AA$10*$AU176^(-12*AA$4-30))*$D176^6)/R176)","v":""},{"$f":"IF($A176=\"\",\"\",((AB$5*$AU176^(-2*AB$4))*$D176+2*(AB$6*$AU176^(-4*AB$4-2))*$D176^2+3*(AB$7*$AU176^(-6*AB$4-6))*$D176^3+4*(AB$8*$AU176^(-8*AB$4-12))*$D176^4+5*(AB$9*$AU176^(-10*AB$4-20))*$D176^5+6*(AB$10*$AU176^(-12*AB$4-30))*$D176^6)/S176)","v":""},{"$f":"IF($A176=\"\",\"\",((AC$5*$AU176^(-2*AC$4))*$D176+2*(AC$6*$AU176^(-4*AC$4-2))*$D176^2)/T176)","v":""},{"$f":"IF($A176=\"\",\"\",((AD$5*$AU176^(-2*AD$4))*$D176+2*(AD$6*$AU176^(-4*AD$4-2))*$D176^2)/U176)","v":""},{"$f":"IF($A176=\"\",\"\",((AE$5*$AU176^(-2*AE$4))*$D176+2*(AE$6*$AU176^(-4*AE$4-2))*$D176^2)/V176)","v":""},{"$f":"IF(B$11=0,\"\",IF($A176=\"\",\"\",0.5*B$11*$L176*(1*V$4^2+(V$5*$AU176^(-2*V$4))*$D176*(V$4+1)^2+(V$6*$AU176^(-4*V$4-2))*$D176^2*(V$4+2)^2+(V$7*$AU176^(-6*V$4-6))*$D176^3*(V$4+3)^2+(V$8*$AU176^(-8*V$4-12))*$D176^4*(V$4+4)^2+(V$9*$AU176^(-10*V$4-20))*$D176^5*(V$4+5)^2+(V$10*$AU176^(-12*V$4-30))*$D176^6*(V$4+6)^2)/M176))","v":""},{"$f":"IF(C$11=0,\"\",IF($A176=\"\",\"\",0.5*C$11*$L176*(1*W$4^2+(W$5*$AU176^(-2*W$4))*$D176*(W$4+1)^2+(W$6*$AU176^(-4*W$4-2))*$D176^2*(W$4+2)^2+(W$7*$AU176^(-6*W$4-6))*$D176^3*(W$4+3)^2+(W$8*$AU176^(-8*W$4-12))*$D176^4*(W$4+4)^2+(W$9*$AU176^(-10*W$4-20))*$D176^5*(W$4+5)^2+(W$10*$AU176^(-12*W$4-30))*$D176^6*(W$4+6)^2)/N176))","v":""},{"$f":"IF(D$11=0,\"\",IF($A176=\"\",\"\",0.5*D$11*$L176*(1*X$4^2+(X$5*$AU176^(-2*X$4))*$D176*(X$4+1)^2+(X$6*$AU176^(-4*X$4-2))*$D176^2*(X$4+2)^2+(X$7*$AU176^(-6*X$4-6))*$D176^3*(X$4+3)^2+(X$8*$AU176^(-8*X$4-12))*$D176^4*(X$4+4)^2+(X$9*$AU176^(-10*X$4-20))*$D176^5*(X$4+5)^2+(X$10*$AU176^(-12*X$4-30))*$D176^6*(X$4+6)^2)/O176))","v":""},{"$f":"IF(E$11=0,\"\",IF($A176=\"\",\"\",0.5*E$11*$L176*(1*Y$4^2+(Y$5*$AU176^(-2*Y$4))*$D176*(Y$4+1)^2+(Y$6*$AU176^(-4*Y$4-2))*$D176^2*(Y$4+2)^2+(Y$7*$AU176^(-6*Y$4-6))*$D176^3*(Y$4+3)^2+(Y$8*$AU176^(-8*Y$4-12))*$D176^4*(Y$4+4)^2+(Y$9*$AU176^(-10*Y$4-20))*$D176^5*(Y$4+5)^2+(Y$10*$AU176^(-12*Y$4-30))*$D176^6*(Y$4+6)^2)/P176))","v":""},{"$f":"IF(F$11=0,\"\",IF($A176=\"\",\"\",0.5*F$11*$L176*(1*Z$4^2+(Z$5*$AU176^(-2*Z$4))*$D176*(Z$4+1)^2+(Z$6*$AU176^(-4*Z$4-2))*$D176^2*(Z$4+2)^2+(Z$7*$AU176^(-6*Z$4-6))*$D176^3*(Z$4+3)^2+(Z$8*$AU176^(-8*Z$4-12))*$D176^4*(Z$4+4)^2+(Z$9*$AU176^(-10*Z$4-20))*$D176^5*(Z$4+5)^2+(Z$10*$AU176^(-12*Z$4-30))*$D176^6*(Z$4+6)^2)/Q176))","v":""},{"$f":"IF(G$11=0,\"\",IF($A176=\"\",\"\",0.5*G$11*$L176*(1*AA$4^2+(AA$5*$AU176^(-2*AA$4))*$D176*(AA$4+1)^2+(AA$6*$AU176^(-4*AA$4-2))*$D176^2*(AA$4+2)^2+(AA$7*$AU176^(-6*AA$4-6))*$D176^3*(AA$4+3)^2+(AA$8*$AU176^(-8*AA$4-12))*$D176^4*(AA$4+4)^2+(AA$9*$AU176^(-10*AA$4-20))*$D176^5*(AA$4+5)^2+(AA$10*$AU176^(-12*AA$4-30))*$D176^6*(AA$4+6)^2)/R176))","v":""},{"$f":"IF(H$11=0,\"\",IF($A176=\"\",\"\",0.5*H$11*$L176*(1*AB$4^2+(AB$5*$AU176^(-2*AB$4))*$D176*(AB$4+1)^2+(AB$6*$AU176^(-4*AB$4-2))*$D176^2*(AB$4+2)^2+(AB$7*$AU176^(-6*AB$4-6))*$D176^3*(AB$4+3)^2+(AB$8*$AU176^(-8*AB$4-12))*$D176^4*(AB$4+4)^2+(AB$9*$AU176^(-10*AB$4-20))*$D176^5*(AB$4+5)^2+(AB$10*$AU176^(-12*AB$4-30))*$D176^6*(AB$4+6)^2)/S176))","v":""},{"$f":"IF(B$18=0,\"\",IF($A176=\"\",\"\",0.5*B$18*$K176*(1*AC$4^2+(AC$5*$AU176^(-2*AC$4))*$D176*(AC$4+1)^2+(AC$6*$AU176^(-4*AC$4-2))*$D176^2*(AC$4+2)^2)/T176))","v":""},{"$f":"IF(C$18=0,\"\",IF($A176=\"\",\"\",0.5*C$18*$K176*(1*AD$4^2+(AD$5*$AU176^(-2*AD$4))*$D176*(AD$4+1)^2+(AD$6*$AU176^(-4*AD$4-2))*$D176^2*(AD$4+2)^2)/U176))","v":""},{"$f":"IF(D$18=0,\"\",IF($A176=\"\",\"\",0.5*D$18*$K176*(1*AE$4^2+(AE$5*$AU176^(-2*AE$4))*$D176*(AE$4+1)^2+(AE$6*$AU176^(-4*AE$4-2))*$D176^2*(AE$4+2)^2)/V176))","v":""},{"$f":"IF(A176=\"\",\"\",SUM(AG176:AP176)+0.5*(D176+ $AC$9/AU176^2/D176)+$L176*$S$16+$K176*$T$16)","v":""},{"$f":"IF(A176=\"\",\"\",AQ176+$L176*S$14+$K176*$T$14)","v":""},null,null,{"$f":"IF(A176=\"\",\"\",10^(-$P$16*($AT176^0.5/(1+$AT176^0.5)-$P$17*$AT176)))","v":""},null,{"$f":"IF(C176=\"\",\"\",C176-B176)","v":""}]
[null,null,null,"","","","","","","","","","","","","","","","","","","","","","","","","","","","","","","","","","","","","","","","","",null,null,"",null,""]
[null,null,null,"","","","","","","","","","","","","","","","","","","","","","","","","","","","","","","","","","","","","","","","","",null,null,"",null,""]
[null,null,null,"","","","","","","","","","","","","","","","","","","","","","","","","","","","","","","","","","","","","","","","","",null,null,"",null,""]
[null,null,null,"","","","","","","","","","","","","","","","","","","","","","","","","","","","","","","","","","","","","","","","","",null,null,"",null,""]
[null,null,null,"","","","","","","","","","","","","","","","","","","","","","","","","","","","","","","","","","","","","","","","","",null,null,"",null,""]
[null,null,null,"","","","","","","","","","","","","","","","","","","","","","","","","","","","","","","","","","","","","","","","","",null,null,"",null,""]
[null,null,null,"","","","","","","","","","","","","","","","","","","","","","","","","","","","","","","","","","","","","","","","","",null,null,"",null,""]
[null,null,null,"","","","","","","","","","","","","","","","","","","","","","","","","","","","","","","","","","","","","","","","","",null,null,"",null,""]
[null,null,null,"","","","","","","","","","","","","","","","","","","","","","","","","","","","","","","","","","","","","","","","","",null,null,"",null,""]
[null,null,null,"","","","","","","","","","","","","","","","","","","","","","","","","","","","","","","","","","","","","","","","","",null,null,"",null,""]
[null,null,null,"","","","","","","","","","","","","","","","","","","","","","","","","","","","","","","","","","","","","","","","","",null,null,"",null,""]
[null,null,null,"","","","","","","","","","","","","","","","","","","","","","","","","","","","","","","","","","","","","","","","","",null,null,"",null,""]
[null,null,null,"","","","","","","","","","","","","","","","","","","","","","","","","","","","","","","","","","","","","","","","","",null,null,"",null,""]
[null,null,null,"","","","","","","","","","","","","","","","","","","","","","","","","","","","","","","","","","","","","","","","","",null,null,"",null,""]
[null,null,null,"","","","","","","","","","","","","","","","","","","","","","","","","","","","","","","","","","","","","","","","","",null,null,"",null,""]
[null,null,null,"","","","","","","","","","","","","","","","","","","","","","","","","","","","","","","","","","","","","","","","","",null,null,"",null,""]
[null,null,null,"","","","","","","","","","","","","","","","","","","","","","","","","","","","","","","","","","","","","","","","","",null,null,"",null,""]
[null,null,null,"","","","","","","","","","","","","","","","","","","","","","","","","","","","","","","","","","","","","","","","","",null,null,"",null,""]
[null,null,null,"","","","","","","","","","","","","","","","","","","","","","","","","","","","","","","","","","","","","","","","","",null,null,"",null,""]
[null,null,null,"","","","","","","","","","","","","","","","","","","","","","","","","","","","","","","","","","","","","","","","","",null,null,"",null,""]
[null,null,null,"","","","","","","","","","","","","","","","","","","","","","","","","","","","","","","","","","","","","","","","","",null,null,"",null,""]
[null,null,null,"","","","","","","","","","","","","","","","","","","","","","","","","","","","","","","","","","","","","","","","","",null,null,"",null,""]
[null,null,null,"","","","","","","","","","","","","","","","","","","","","","","","","","","","","","","","","","","","","","","","","",null,null,"",null,""]
[null,null,null,"","","","","","","","","","","","","","","","","","","","","","","","","","","","","","","","","","","","","","","","","",null,null,"",null,""]
[null,null,null,"","","","","","","","","","","","","","","","","","","","","","","","","","","","","","","","","","","","","","","","","",null,null,"",null,""]

{"sheet":"+Reg","index":9,"n_rows":4,"n_cols":3,"rows_kept":4,"cut":false,"hidden":false,"merged":[]}
[null,"           ","Compilation of essential data and results obtained with the Regression analysis module"]
[]
[]
[null,"Identify the results and add observations (use any gray cell)"]

{"sheet":"Graphs","index":10,"n_rows":311,"n_cols":41,"rows_kept":311,"cut":false,"hidden":false,"merged":[]}
[null,null,"Titration curves and first derivatives overlay "]
["       Source of data to plot/overlay"]
[true,false,{"$f":"IF(Simulation!B41=\"\",\"No Data\",\"\")","v":""},false,null,false,{"$f":"IF(Simulation!D41=\"\",\"No Data\",\"\")","v":"No Data"},null,"Update curve(s) after any change in Simulation, Evaluation or Regression "]
[true,false,{"$f":"IF(Evaluation!B41=\"\",\"No Data\",\"\")","v":""},false,null,true,{"$f":"IF(Evaluation!C41=\"\",\"No Data\",\"\")","v":""},null,"How to change the axis of a curve",null,null,null,null,"Data ID on curves"]
[true,false,{"$f":"IF(Regression!B41=\"\",\"No Data\",\"\")","v":""},false,null,false,{"$f":"IF(Regression!C41=\"\",\"No Data\",\"\")","v":""},null,"How to copy/paste a curve"]
[]
[]
[]
[null,null,null,null,null,null,null,null,null,null,null,null,null,null,null,null,null,null,"Simulation",null,null,"Simulation with dispersion (random errors)",null,null,null,null,"Evaluation",null,null,"Evaluation with smoothing/interpolation",null,null,null,null,"Regression raw data",null,null,null,"Regression fitted curve"]
[null,null,null,null,null,null,null,null,null,null,null,null,null,null,null,null,null,"Vol","pH","Vol","dpH/dVol","Vol","pH","Vol","dpH/dVol","Vol","pH","Vol","dpH/dVol","Vol","pH","Vol","dpH/dVol","Vol","pH","Vol","dpH/dVol","Vol","pH","Vol","dpH/dVol"]
[null,null,null,null,null,null,null,null,null,null,null,null,null,null,null,null,null,0,1.8059327094815671,null,null,null,null,null,null,0,2.2653477877937256,null,null,null,null,null,null,0,2.2808282657451926]
[null,null,null,null,null,null,null,null,null,null,null,null,null,null,null,null,null,2.1570917087956332,2.0204353218153117,null,null,null,null,null,null,2.498869968985673,2.3861369323544204,null,null,null,null,8.3333333326057371E-2,1.7520986416828761E-2,0.89688894076971337,2.4714166043065489]
[null,null,null,null,null,null,null,null,null,null,null,null,null,null,null,null,null,4.0960384285426699,2.2349379341490567,null,null,null,null,null,null,4.6176066432963125,2.6641118475981056,null,null,null,null,0.24999999997817213,1.8362835528923274E-2,1.8641394926817156,2.662466105993837]
[null,null,null,null,null,null,null,null,null,null,null,null,null,null,null,null,null,5.7539623652701266,2.4494405464828013,null,null,null,null,null,null,6.2783207700704224,2.7841898506693541,null,null,null,null,0.41666666663028684,2.0046533753117626E-2,2.9605798234115355,2.8605852687023581]
[null,null,null,null,null,null,null,null,null,null,null,null,null,null,null,null,null,7.0770850390545093,2.6639431588165463,null,null,null,null,null,null,7.4992138441302814,3.0585092287696898,null,null,null,null,0.58333333328240156,2.2572081089406497E-2,4.1980953348684125,3.0949879734255372]
[null,null,null,null,null,null,null,null,null,null,null,null,null,null,null,null,null,8.060804101114627,2.8784457711502909,null,null,null,null,null,null,8.3545435321866535,3.3024845674820242,null,null,null,null,0.74999999993451638,2.5939477537792542E-2,5.5483564428868704,3.2735308732353152]
[null,null,null,null,null,null,null,null,null,null,null,null,null,null,null,null,null,8.7492475504404865,3.0929483834840354,null,null,null,null,null,null,8.933838079974521,3.43747849104926,null,null,null,null,0.9166666665866311,3.0148723098275744E-2,6.9703873581602238,3.4831263395957648]
[null,null,null,null,null,null,null,null,null,null,null,null,null,null,null,null,null,9.2095433516078629,3.3074509958177805,null,null,null,null,null,null,9.3177054906846024,3.552244313005358,null,null,null,null,1.0833333332387458,3.5199817770856186E-2,8.4402233464061283,3.6744159386791289]
[null,null,null,null,null,null,null,null,null,null,null,null,null,null,null,null,null,9.5078176775132306,3.5219536081515255,null,null,null,null,null,null,9.5692240152857266,3.823462932128459,null,null,null,null,1.2499999998908606,4.1092761555531043E-2,9.9575227286550216,3.8778446124009789]
[null,null,null,null,null,null,null,null,null,null,null,null,null,null,null,null,null,9.6974923231755383,3.73645622048527,null,null,null,null,null,null,9.7341329892515205,3.8905521011166275,null,null,null,null,1.4166666665429752,4.7827554452303127E-2,11.527829080296215,4.0878315094076099]
[null,null,null,null,null,null,null,null,null,null,null,null,null,null,null,null,null,9.8172888814588077,3.9509588328190146,null,null,null,null,null,null,9.8443795563071035,4.3014524261839684,null,null,null,null,1.5833333331950901,5.5404196461172457E-2,13.142040256934706,4.2595044983066614]
[null,null,null,null,null,null,null,null,null,null,null,null,null,null,null,null,null,9.8936794631299563,4.1654614451527596,null,null,null,null,null,null,9.9221950062201358,4.1180299079231917,null,null,null,null,1.7499999998472049,6.3822687582138826E-2,14.768722133885603,4.4838214059062302]
[null,null,null,null,null,null,null,null,null,null,null,null,null,null,null,null,null,9.9443849801900797,4.3799640574865037,null,null,null,null,null,null,9.9836717694415711,4.4222375270910561,null,null,null,null,1.9166666664993195,7.3083027815199764E-2,16.356732237909455,4.6824077536202964]
[null,null,null,null,null,null,null,null,null,null,null,null,null,null,null,null,null,9.9815251436666586,4.5944666698202496,null,null,null,null,null,null,10.041700130386744,4.8408818402700122,null,null,null,null,2.0833333331514341,8.3185217160357997E-2,17.844781892199535,4.8893591124005615]
[null,null,null,null,null,null,null,null,null,null,null,null,null,null,null,null,null,10.014129265618976,4.8089692821539938,null,null,null,null,null,null,10.108475277957041,5.18642603373155,null,null,null,null,2.2499999998035491,9.4129255617615981E-2,19.181782512168866,5.0960081052444872]
[null,null,null,null,null,null,null,null,null,null,null,null,null,null,null,null,null,10.050161390972789,5.0234718944877388,null,null,null,null,null,null,10.197893586882856,5.1923094727657739,null,null,null,null,2.4166666664556637,0.10591514302217735,20.351667587237898,5.295324570912868]
[null,null,null,null,null,null,null,null,null,null,null,null,null,null,null,null,null,10.09834472934017,5.2379745068214838,null,null,null,null,null,null,10.328164369275328,5.3796424258686599,null,null,null,null,2.5833333331077784,0.11800336451524747,21.384160743036773,5.5011578789688649]
[null,null,null,null,null,null,null,null,null,null,null,null,null,null,null,null,null,10.170080677198712,5.4524771191552279,null,null,null,null,null,null,10.524891586101148,5.5674684633873399,null,null,null,null,2.7499999997598934,0.1282793109455409,22.342685637704562,5.6875888803489509]
[null,null,null,null,null,null,null,null,null,null,null,null,null,null,null,null,null,10.281694422883447,5.6669797314889729,null,null,null,null,null,null,10.824641671206336,5.7681651949696242,null,null,null,null,2.916666666412008,0.13622497476391454,23.297000558522996,5.8781362815611065]
[null,null,null,null,null,null,null,null,null,null,null,null,null,null,null,null,null,10.45702534756856,5.881482343822718,null,null,null,null,null,null,11.278386386402417,6.0832747816853221,null,null,null,null,3.0833333330641226,0.14184035597035616,24.292349834286142,6.0934056529216472]
[null,null,null,null,null,null,null,null,null,null,null,null,null,null,null,null,null,10.729793940845411,6.0959849561564621,null,null,null,null,null,null,11.952848396322224,6.2216419441439212,null,null,null,null,3.2499999997162377,0.1451254545648753,25.326453409797978,6.3068681297414004]
[null,null,null,null,null,null,null,null,null,null,null,null,null,null,null,null,null,11.143875245761592,6.3104875684902071,null,null,null,null,null,null,12.925509912020061,6.4441657189466062,null,null,null,null,3.4166666663683523,0.14608027054746395,26.347641290340107,6.4901526380963626]
[null,null,null,null,null,null,null,null,null,null,null,null,null,null,null,null,null,11.747540258511435,6.5249901808239521,null,null,null,null,null,null,14.266958106600214,6.6170152428187432,null,null,null,null,3.5833333330204669,0.14470480391813131,27.280329070345033,6.6984786649681629]
[null,null,null,null,null,null,null,null,null,null,null,null,null,null,null,null,null,12.576544815965462,6.7394927931576971,null,null,null,null,null,null,16.006536425265949,6.8276927663199602,null,null,null,null,3.7499999996725819,0.14099905467686816,28.062663164746482,6.8921215216629204]
[null,null,null,null,null,null,null,null,null,null,null,null,null,null,null,null,null,13.625772965315264,6.9539954054914412,null,null,null,null,null,null,18.090350537386257,6.9951606211625039,null,null,null,null,3.9166666663246965,0.13496302282368255,28.669746332161594,7.0865812115333977]
[null,null,null,null,null,null,null,null,null,null,null,null,null,null,null,null,null,14.824491734907497,7.1684980178251863,null,null,null,null,null,null,20.361693068116438,7.2242915053851906,null,null,null,null,4.0833333329768111,0.12659670835856526,29.111924824246671,7.3027161829434339]
[null,null,null,null,null,null,null,null,null,null,null,null,null,null,null,null,null,16.043755009013694,7.3830006301589313,null,null,null,null,null,null,22.596293150854763,7.5369926953129474,null,null,null,null,4.2499999996289262,0.11590011128152719,29.419084104301874,7.5183351617865268]
[null,null,null,null,null,null,null,null,null,null,null,null,null,null,null,null,null,17.145786933542695,7.5975032424926754,null,null,null,null,null,null,24.583749643352348,7.6312835094146427,null,null,null,null,4.4166666662810403,0.10287323159255969,29.625479625246953,7.7038716139905157]
[null,null,null,null,null,null,null,null,null,null,null,null,null,null,null,null,null,18.040535067848396,7.8120058548264204,null,null,null,null,null,null,26.198946092335973,7.78317475317046,null,null,null,null,4.5833333329331554,8.7545481368905539E-2,29.761181406502146,7.9083233626820144]
[null,null,null,null,null,null,null,null,null,null,null,null,null,null,null,null,null,18.705899156339001,8.0265084671601663,null,null,null,null,null,null,27.418202777334955,7.9825341033004227,null,null,null,null,4.7499999995852704,7.2299869115006049E-2,29.849311058933381,8.1149909251295025]
[null,null,null,null,null,null,null,null,null,null,null,null,null,null,null,null,null,19.169210402469616,8.2410110794939104,null,null,null,null,null,null,28.288458079623524,8.2847767613641921,null,null,null,null,4.9166666662373846,6.1237749785455084E-2,29.90638507908443,8.2506355920545751]
[null,null,null,null,null,null,null,null,null,null,null,null,null,null,null,null,null,19.477512511366513,8.4555136918276546,null,null,null,null,null,null,28.885414720571134,8.4060754944570366,null,null,null,null,5.0833333328894996,5.476429407357998E-2,29.94375132402638,8.5722924061678345]
[null,null,null,null,null,null,null,null,null,null,null,null,null,null,null,null,null,19.67695818602806,8.6700163041614005,null,null,null,null,null,null,29.284366952197161,8.6294696083106093,null,null,null,null,5.2499999995416147,5.2879501979374556E-2,29.969121598696802,8.6735323605053125]
[null,null,null,null,null,null,null,null,null,null,null,null,null,null,null,null,null,19.804373894294258,8.8845189164951446,null,null,null,null,null,null,29.547248141898308,8.7976750612445169,null,null,null,null,5.4166666661937288,5.5583373502847658E-2,29.987858388631139,8.949234131556004]
[null,null,null,null,null,null,null,null,null,null,null,null,null,null,null,null,null,19.886334486363921,9.0990215288288887,null,null,null,null,null,null,29.720264744537417,9.0960117106325917,null,null,null,null,5.5833333328458439,6.2875908643991354E-2,30.003981960180681,9.1845845668949195]
[null,null,null,null,null,null,null,null,null,null,null,null,null,null,null,null,null,19.94123642652994,9.3135241411626346,null,null,null,null,null,null,29.83625626511639,9.0847907523252065,null,null,null,null,5.7499999994979589,7.4757107402807291E-2,30.020979327673558,9.2019186423607167]
[null,null,null,null,null,null,null,null,null,null,null,null,null,null,null,null,null,19.981976119743194,9.5280267534963787,null,null,null,null,null,null,29.918337061826605,9.400064428430051,null,null,null,null,5.9166666661500731,9.1226969779299158E-2,30.042530830542091,9.5545939252935348]
[null,null,null,null,null,null,null,null,null,null,null,null,null,null,null,null,null,20.018397706735414,9.7425293658301229,null,null,null,null,null,null,29.98338512115879,9.4506547726504504,null,null,null,null,6.0833333328021881,0.11228549577346186,30.073280991928186,9.7397145399264993]
[null,null,null,null,null,null,null,null,null,null,null,null,null,null,null,null,null,20.059441142075229,9.9570319781638688,null,null,null,null,null,null,30.045040389813948,9.8117745951004327,null,null,null,null,6.2499999994543032,0.13788956154991522,30.119792056211736,9.921328281220049]
[null,null,null,null,null,null,null,null,null,null,null,null,null,null,null,null,null,20.115236625133548,10.171534590497613,null,null,null,null,null,null,30.116360024840105,10.284517781157046,null,null,null,null,6.4166666661064173,0.16538998895541748,30.191834959259722,10.118093901764601]
[null,null,null,null,null,null,null,null,null,null,null,null,null,null,null,null,null,20.199536230938975,10.386037202831357,null,null,null,null,null,null,30.212474045401905,10.294536398407072,null,null,null,null,6.5833333327585324,0.19064464761456792,30.304181580140721,10.340274881910533]
[null,null,null,null,null,null,null,null,null,null,null,null,null,null,null,null,null,20.332998641242739,10.600539815165103,null,null,null,null,null,null,30.353687058959622,10.521781745608896,null,null,null,null,6.7499999994106474,0.21329299556238734,30.479027204273734,10.526514122683555]
[null,null,null,null,null,null,null,null,null,null,null,null,null,null,null,null,null,20.548015915846918,10.815042427498847,null,null,null,null,null,null,30.569570830266457,10.627726228442043,null,null,null,null,6.9166666660627616,0.23333503279887352,30.749027973797638,10.716714065384119]
[null,null,null,null,null,null,null,null,null,null,null,null,null,null,null,null,null,20.896024066314567,11.029545039832591,null,null,null,null,null,null,30.904717471275944,10.915235111545771,null,null,null,null,7.0833333327148766,0.25077075932402937,31.160632845421787,10.92176637821272]
[null,null,null,null,null,null,null,null,null,null,null,null,null,null,null,null,null,21.458622148202267,11.244047652166337,null,null,null,null,null,null,31.426960798853543,11.084914463479072,null,null,null,null,7.2499999993669917,0.2656001751378616,31.777109763061162,11.123641830880194]
[null,null,null,null,null,null,null,null,null,null,null,null,null,null,null,null,null,22.364652594842482,11.458550264500081,null,null,null,null,null,null,32.239001510606613,11.226372458133847,null,null,null,null,7.4166666660191058,0.27782328012886875,32.681422297901008,11.335130838844925]
[null,null,null,null,null,null,null,null,null,null,null,null,null,null,null,null,null,23.818284484150354,11.673052876833827,null,null,null,null,null,null,33.494635509850923,11.385016548875718,null,null,null,null,7.5833333326712209,0.28636268375169016,33.983392054506112,11.515661543425173]
[null,null,null,null,null,null,null,null,null,null,null,null,null,null,null,null,null,26.154666273214389,11.887555489167571,null,null,null,null,null,null,35.422255621233489,11.676670697722583,null,null,null,null,7.7499999993233359,0.28696937644847303,35.846407026110683,11.742123357553035]
[null,null,null,null,null,null,null,null,null,null,null,null,null,null,null,null,null,29.98321672930615,12.102058101501315,null,null,null,null,null,null,38.365417947352398,11.805349126476795,null,null,null,null,7.9166666659754501,0.27859603188108878,38.567444209184032,11.919127186704428]
[null,null,null,null,null,null,null,null,null,null,null,null,null,null,null,null,null,36.643806887150276,12.316560713835061,null,null,null,null,null,null,42.877503424824681,12.00734264222905,null,null,null,null,8.0833333326275643,0.26124265004952396,42.780707859492395,12.134579030226917]
[null,null,null,null,null,null,null,null,null,null,null,null,null,null,null,null,null,49.999999998544808,12.531063326168805,null,null,null,null,null,null,49.999999995634425,12.223539364431053,null,null,null,null,8.2499999992796802,0.23490923095379432,49.999999983992893,12.329984020184726]
[null,null,null,null,null,null,null,null,null,null,null,null,null,null,null,null,null,null,null,null,null,null,null,null,null,null,null,null,null,null,null,8.4166666659317944,0.20330271463889535]
[null,null,null,null,null,null,null,null,null,null,null,null,null,null,null,null,null,null,null,null,null,null,null,null,null,null,null,null,null,null,null,8.5833333325839085,0.18822174925058086]
[null,null,null,null,null,null,null,null,null,null,null,null,null,null,null,null,null,null,null,null,null,null,null,null,null,null,null,null,null,null,null,8.7499999992360245,0.19760833012114573]
[null,null,null,null,null,null,null,null,null,null,null,null,null,null,null,null,null,null,null,null,null,null,null,null,null,null,null,null,null,null,null,8.9166666658881386,0.23236967615874882]
[null,null,null,null,null,null,null,null,null,null,null,null,null,null,null,null,null,null,null,null,null,null,null,null,null,null,null,null,null,null,null,9.0833333325402528,0.32795836615556778]
[null,null,null,null,null,null,null,null,null,null,null,null,null,null,null,null,null,null,null,null,null,null,null,null,null,null,null,null,null,null,null,9.2499999991923687,0.53079586060204731]
[null,null,null,null,null,null,null,null,null,null,null,null,null,null,null,null,null,null,null,null,null,null,null,null,null,null,null,null,null,null,null,9.4166666658444829,0.8420478352269879]
[null,null,null,null,null,null,null,null,null,null,null,null,null,null,null,null,null,null,null,null,null,null,null,null,null,null,null,null,null,null,null,9.583333332496597,1.2593830244773367]
[null,null,null,null,null,null,null,null,null,null,null,null,null,null,null,null,null,null,null,null,null,null,null,null,null,null,null,null,null,null,null,9.749999999148713,1.826495888656358]
[null,null,null,null,null,null,null,null,null,null,null,null,null,null,null,null,null,null,null,null,null,null,null,null,null,null,null,null,null,null,null,9.9166666658008271,2.3964619072744928]
[null,null,null,null,null,null,null,null,null,null,null,null,null,null,null,null,null,null,null,null,null,null,null,null,null,null,null,null,null,null,null,10.083333332452941,2.4675417395465375]
[null,null,null,null,null,null,null,null,null,null,null,null,null,null,null,null,null,null,null,null,null,null,null,null,null,null,null,null,null,null,null,10.249999999105057,1.8842722453797238]
[null,null,null,null,null,null,null,null,null,null,null,null,null,null,null,null,null,null,null,null,null,null,null,null,null,null,null,null,null,null,null,10.416666665757171,1.3087855288571792]
[null,null,null,null,null,null,null,null,null,null,null,null,null,null,null,null,null,null,null,null,null,null,null,null,null,null,null,null,null,null,null,10.583333332409286,0.921572568866873]
[null,null,null,null,null,null,null,null,null,null,null,null,null,null,null,null,null,null,null,null,null,null,null,null,null,null,null,null,null,null,null,10.749999999061401,0.70149690203552661]
[null,null,null,null,null,null,null,null,null,null,null,null,null,null,null,null,null,null,null,null,null,null,null,null,null,null,null,null,null,null,null,10.916666665713516,0.60130068344842647]
[null,null,null,null,null,null,null,null,null,null,null,null,null,null,null,null,null,null,null,null,null,null,null,null,null,null,null,null,null,null,null,11.08333333236563,0.51132573932293945]
[null,null,null,null,null,null,null,null,null,null,null,null,null,null,null,null,null,null,null,null,null,null,null,null,null,null,null,null,null,null,null,11.249999999017746,0.40841060685393238]
[null,null,null,null,null,null,null,null,null,null,null,null,null,null,null,null,null,null,null,null,null,null,null,null,null,null,null,null,null,null,null,11.41666666566986,0.30917598783804112]
[null,null,null,null,null,null,null,null,null,null,null,null,null,null,null,null,null,null,null,null,null,null,null,null,null,null,null,null,null,null,null,11.583333332321974,0.23963659806365117]
[null,null,null,null,null,null,null,null,null,null,null,null,null,null,null,null,null,null,null,null,null,null,null,null,null,null,null,null,null,null,null,11.74999999897409,0.20206005164477692]
[null,null,null,null,null,null,null,null,null,null,null,null,null,null,null,null,null,null,null,null,null,null,null,null,null,null,null,null,null,null,null,11.916666665626204,0.1963004492861376]
[null,null,null,null,null,null,null,null,null,null,null,null,null,null,null,null,null,null,null,null,null,null,null,null,null,null,null,null,null,null,null,12.083333332278318,0.20933639749566119]
[null,null,null,null,null,null,null,null,null,null,null,null,null,null,null,null,null,null,null,null,null,null,null,null,null,null,null,null,null,null,null,12.249999998930434,0.21805115613761233]
[null,null,null,null,null,null,null,null,null,null,null,null,null,null,null,null,null,null,null,null,null,null,null,null,null,null,null,null,null,null,null,12.416666665582548,0.22006880548156704]
[null,null,null,null,null,null,null,null,null,null,null,null,null,null,null,null,null,null,null,null,null,null,null,null,null,null,null,null,null,null,null,12.583333332234663,0.21538934552754307]
[null,null,null,null,null,null,null,null,null,null,null,null,null,null,null,null,null,null,null,null,null,null,null,null,null,null,null,null,null,null,null,12.749999998886778,0.20401277627554401]
[null,null,null,null,null,null,null,null,null,null,null,null,null,null,null,null,null,null,null,null,null,null,null,null,null,null,null,null,null,null,null,12.916666665538893,0.18608739878924188]
[null,null,null,null,null,null,null,null,null,null,null,null,null,null,null,null,null,null,null,null,null,null,null,null,null,null,null,null,null,null,null,13.083333332191007,0.16605208387032477]
[null,null,null,null,null,null,null,null,null,null,null,null,null,null,null,null,null,null,null,null,null,null,null,null,null,null,null,null,null,null,null,13.249999998843123,0.14900524070362345]
[null,null,null,null,null,null,null,null,null,null,null,null,null,null,null,null,null,null,null,null,null,null,null,null,null,null,null,null,null,null,null,13.416666665495237,0.13522787205415585]
[null,null,null,null,null,null,null,null,null,null,null,null,null,null,null,null,null,null,null,null,null,null,null,null,null,null,null,null,null,null,null,13.583333332147351,0.12471997792191034]
[null,null,null,null,null,null,null,null,null,null,null,null,null,null,null,null,null,null,null,null,null,null,null,null,null,null,null,null,null,null,null,13.749999998799467,0.11748155830689855]
[null,null,null,null,null,null,null,null,null,null,null,null,null,null,null,null,null,null,null,null,null,null,null,null,null,null,null,null,null,null,null,13.916666665451581,0.11351261320911539]
[null,null,null,null,null,null,null,null,null,null,null,null,null,null,null,null,null,null,null,null,null,null,null,null,null,null,null,null,null,null,null,14.083333332103695,0.11281314262855918]
[null,null,null,null,null,null,null,null,null,null,null,null,null,null,null,null,null,null,null,null,null,null,null,null,null,null,null,null,null,null,null,14.249999998755811,0.11533739722649425]
[null,null,null,null,null,null,null,null,null,null,null,null,null,null,null,null,null,null,null,null,null,null,null,null,null,null,null,null,null,null,null,14.416666665407925,0.11928835796265741]
[null,null,null,null,null,null,null,null,null,null,null,null,null,null,null,null,null,null,null,null,null,null,null,null,null,null,null,null,null,null,null,14.58333333206004,0.12232086636709838]
[null,null,null,null,null,null,null,null,null,null,null,null,null,null,null,null,null,null,null,null,null,null,null,null,null,null,null,null,null,null,null,14.749999998712156,0.12427710375881723]
[null,null,null,null,null,null,null,null,null,null,null,null,null,null,null,null,null,null,null,null,null,null,null,null,null,null,null,null,null,null,null,14.91666666536427,0.12515707013784055]
[null,null,null,null,null,null,null,null,null,null,null,null,null,null,null,null,null,null,null,null,null,null,null,null,null,null,null,null,null,null,null,15.083333332016384,0.12496076550415104]
[null,null,null,null,null,null,null,null,null,null,null,null,null,null,null,null,null,null,null,null,null,null,null,null,null,null,null,null,null,null,null,15.2499999986685,0.12368818985775001]
[null,null,null,null,null,null,null,null,null,null,null,null,null,null,null,null,null,null,null,null,null,null,null,null,null,null,null,null,null,null,null,15.416666665320614,0.12133934319864285]
[null,null,null,null,null,null,null,null,null,null,null,null,null,null,null,null,null,null,null,null,null,null,null,null,null,null,null,null,null,null,null,15.583333331972728,0.11791422552682276]
[null,null,null,null,null,null,null,null,null,null,null,null,null,null,null,null,null,null,null,null,null,null,null,null,null,null,null,null,null,null,null,15.749999998624844,0.1134128368423072]
[null,null,null,null,null,null,null,null,null,null,null,null,null,null,null,null,null,null,null,null,null,null,null,null,null,null,null,null,null,null,null,15.916666665276958,0.10783517714506964]
[null,null,null,null,null,null,null,null,null,null,null,null,null,null,null,null,null,null,null,null,null,null,null,null,null,null,null,null,null,null,null,16.083333331929072,0.1014433852911675]
[null,null,null,null,null,null,null,null,null,null,null,null,null,null,null,null,null,null,null,null,null,null,null,null,null,null,null,null,null,null,null,16.249999998581188,9.541705956487255E-2]
[null,null,null,null,null,null,null,null,null,null,null,null,null,null,null,null,null,null,null,null,null,null,null,null,null,null,null,null,null,null,null,16.416666665233301,9.008785369935815E-2]
[null,null,null,null,null,null,null,null,null,null,null,null,null,null,null,null,null,null,null,null,null,null,null,null,null,null,null,null,null,null,null,16.583333331885417,8.5455785523850039E-2]
[null,null,null,null,null,null,null,null,null,null,null,null,null,null,null,null,null,null,null,null,null,null,null,null,null,null,null,null,null,null,null,16.749999998537533,8.1520855038342763E-2]
[null,null,null,null,null,null,null,null,null,null,null,null,null,null,null,null,null,null,null,null,null,null,null,null,null,null,null,null,null,null,null,16.916666665189645,7.828306224283646E-2]
[null,null,null,null,null,null,null,null,null,null,null,null,null,null,null,null,null,null,null,null,null,null,null,null,null,null,null,null,null,null,null,17.083333331841761,7.5742407137341594E-2]
[null,null,null,null,null,null,null,null,null,null,null,null,null,null,null,null,null,null,null,null,null,null,null,null,null,null,null,null,null,null,null,17.249999998493877,7.3898889721837308E-2]
[null,null,null,null,null,null,null,null,null,null,null,null,null,null,null,null,null,null,null,null,null,null,null,null,null,null,null,null,null,null,null,17.416666665145989,7.2752509996344444E-2]
[null,null,null,null,null,null,null,null,null,null,null,null,null,null,null,null,null,null,null,null,null,null,null,null,null,null,null,null,null,null,null,17.583333331798105,7.2303267960852277E-2]
[null,null,null,null,null,null,null,null,null,null,null,null,null,null,null,null,null,null,null,null,null,null,null,null,null,null,null,null,null,null,null,17.749999998450221,7.2551163615356171E-2]
[null,null,null,null,null,null,null,null,null,null,null,null,null,null,null,null,null,null,null,null,null,null,null,null,null,null,null,null,null,null,null,17.916666665102333,7.3496196959876747E-2]
[null,null,null,null,null,null,null,null,null,null,null,null,null,null,null,null,null,null,null,null,null,null,null,null,null,null,null,null,null,null,null,18.083333331754449,7.5133520329930481E-2]
[null,null,null,null,null,null,null,null,null,null,null,null,null,null,null,null,null,null,null,null,null,null,null,null,null,null,null,null,null,null,null,18.249999998406565,7.7326061928494422E-2]
[null,null,null,null,null,null,null,null,null,null,null,null,null,null,null,null,null,null,null,null,null,null,null,null,null,null,null,null,null,null,null,18.416666665058678,7.9920828230207422E-2]
[null,null,null,null,null,null,null,null,null,null,null,null,null,null,null,null,null,null,null,null,null,null,null,null,null,null,null,null,null,null,null,18.583333331710794,8.2909775165519839E-2]
[null,null,null,null,null,null,null,null,null,null,null,null,null,null,null,null,null,null,null,null,null,null,null,null,null,null,null,null,null,null,null,18.74999999836291,8.6292902734442345E-2]
[null,null,null,null,null,null,null,null,null,null,null,null,null,null,null,null,null,null,null,null,null,null,null,null,null,null,null,null,null,null,null,18.916666665015022,9.007021093698557E-2]
[null,null,null,null,null,null,null,null,null,null,null,null,null,null,null,null,null,null,null,null,null,null,null,null,null,null,null,null,null,null,null,19.083333331667138,9.4241699773128434E-2]
[null,null,null,null,null,null,null,null,null,null,null,null,null,null,null,null,null,null,null,null,null,null,null,null,null,null,null,null,null,null,null,19.249999998319254,9.8807369242886245E-2]
[null,null,null,null,null,null,null,null,null,null,null,null,null,null,null,null,null,null,null,null,null,null,null,null,null,null,null,null,null,null,null,19.416666664971366,0.10376721934625435]
[null,null,null,null,null,null,null,null,null,null,null,null,null,null,null,null,null,null,null,null,null,null,null,null,null,null,null,null,null,null,null,19.583333331623482,0.10912125008322775]
[null,null,null,null,null,null,null,null,null,null,null,null,null,null,null,null,null,null,null,null,null,null,null,null,null,null,null,null,null,null,null,19.749999998275598,0.11486946145382078]
[null,null,null,null,null,null,null,null,null,null,null,null,null,null,null,null,null,null,null,null,null,null,null,null,null,null,null,null,null,null,null,19.91666666492771,0.12101185345800845]
[null,null,null,null,null,null,null,null,null,null,null,null,null,null,null,null,null,null,null,null,null,null,null,null,null,null,null,null,null,null,null,20.083333331579826,0.12754842609582312]
[null,null,null,null,null,null,null,null,null,null,null,null,null,null,null,null,null,null,null,null,null,null,null,null,null,null,null,null,null,null,null,20.249999998231942,0.1344791793672353]
[null,null,null,null,null,null,null,null,null,null,null,null,null,null,null,null,null,null,null,null,null,null,null,null,null,null,null,null,null,null,null,20.416666664884055,0.14160797815626891]
[null,null,null,null,null,null,null,null,null,null,null,null,null,null,null,null,null,null,null,null,null,null,null,null,null,null,null,null,null,null,null,20.583333331536171,0.14761650342760793]
[null,null,null,null,null,null,null,null,null,null,null,null,null,null,null,null,null,null,null,null,null,null,null,null,null,null,null,null,null,null,null,20.749999998188287,0.151961593588511]
[null,null,null,null,null,null,null,null,null,null,null,null,null,null,null,null,null,null,null,null,null,null,null,null,null,null,null,null,null,null,null,20.916666664840399,0.15464155769155732]
[null,null,null,null,null,null,null,null,null,null,null,null,null,null,null,null,null,null,null,null,null,null,null,null,null,null,null,null,null,null,null,21.083333331492515,0.1556563957367364]
[null,null,null,null,null,null,null,null,null,null,null,null,null,null,null,null,null,null,null,null,null,null,null,null,null,null,null,null,null,null,null,21.249999998144631,0.15500610772404896]
[null,null,null,null,null,null,null,null,null,null,null,null,null,null,null,null,null,null,null,null,null,null,null,null,null,null,null,null,null,null,null,21.416666664796743,0.15269069365349963]
[null,null,null,null,null,null,null,null,null,null,null,null,null,null,null,null,null,null,null,null,null,null,null,null,null,null,null,null,null,null,null,21.583333331448859,0.14871015352508293]
[null,null,null,null,null,null,null,null,null,null,null,null,null,null,null,null,null,null,null,null,null,null,null,null,null,null,null,null,null,null,null,21.749999998100975,0.14306448733880531]
[null,null,null,null,null,null,null,null,null,null,null,null,null,null,null,null,null,null,null,null,null,null,null,null,null,null,null,null,null,null,null,21.916666664753087,0.13575369509466031]
[null,null,null,null,null,null,null,null,null,null,null,null,null,null,null,null,null,null,null,null,null,null,null,null,null,null,null,null,null,null,null,22.083333331405203,0.12677777679264748]
[null,null,null,null,null,null,null,null,null,null,null,null,null,null,null,null,null,null,null,null,null,null,null,null,null,null,null,null,null,null,null,22.249999998057319,0.11613673243278003]
[null,null,null,null,null,null,null,null,null,null,null,null,null,null,null,null,null,null,null,null,null,null,null,null,null,null,null,null,null,null,null,22.416666664709432,0.10383056201503937]
[null,null,null,null,null,null,null,null,null,null,null,null,null,null,null,null,null,null,null,null,null,null,null,null,null,null,null,null,null,null,null,22.583333331361548,8.9906052114709534E-2]
[null,null,null,null,null,null,null,null,null,null,null,null,null,null,null,null,null,null,null,null,null,null,null,null,null,null,null,null,null,null,null,22.749999998013664,7.5964023248672199E-2]
[null,null,null,null,null,null,null,null,null,null,null,null,null,null,null,null,null,null,null,null,null,null,null,null,null,null,null,null,null,null,null,22.916666664665776,6.3965995328551267E-2]
[null,null,null,null,null,null,null,null,null,null,null,null,null,null,null,null,null,null,null,null,null,null,null,null,null,null,null,null,null,null,null,23.083333331317892,5.4031829870492848E-2]
[null,null,null,null,null,null,null,null,null,null,null,null,null,null,null,null,null,null,null,null,null,null,null,null,null,null,null,null,null,null,null,23.249999997970008,4.6161526874493479E-2]
[null,null,null,null,null,null,null,null,null,null,null,null,null,null,null,null,null,null,null,null,null,null,null,null,null,null,null,null,null,null,null,23.41666666462212,4.0355086340567274E-2]
[null,null,null,null,null,null,null,null,null,null,null,null,null,null,null,null,null,null,null,null,null,null,null,null,null,null,null,null,null,null,null,23.583333331274236,3.6612508268697878E-2]
[null,null,null,null,null,null,null,null,null,null,null,null,null,null,null,null,null,null,null,null,null,null,null,null,null,null,null,null,null,null,null,23.749999997926352,3.4933792658898934E-2]
[null,null,null,null,null,null,null,null,null,null,null,null,null,null,null,null,null,null,null,null,null,null,null,null,null,null,null,null,null,null,null,23.916666664578464,3.5318939511162127E-2]
[null,null,null,null,null,null,null,null,null,null,null,null,null,null,null,null,null,null,null,null,null,null,null,null,null,null,null,null,null,null,null,24.08333333123058,3.7767948825492809E-2]
[null,null,null,null,null,null,null,null,null,null,null,null,null,null,null,null,null,null,null,null,null,null,null,null,null,null,null,null,null,null,null,24.249999997882696,4.228082060188857E-2]
[null,null,null,null,null,null,null,null,null,null,null,null,null,null,null,null,null,null,null,null,null,null,null,null,null,null,null,null,null,null,null,24.416666664534809,4.8857554840346484E-2]
[null,null,null,null,null,null,null,null,null,null,null,null,null,null,null,null,null,null,null,null,null,null,null,null,null,null,null,null,null,null,null,24.583333331186925,5.7439512940736973E-2]
[null,null,null,null,null,null,null,null,null,null,null,null,null,null,null,null,null,null,null,null,null,null,null,null,null,null,null,null,null,null,null,24.749999997839041,6.6662055449120503E-2]
[null,null,null,null,null,null,null,null,null,null,null,null,null,null,null,null,null,null,null,null,null,null,null,null,null,null,null,null,null,null,null,24.916666664491153,7.5151621610090577E-2]
[null,null,null,null,null,null,null,null,null,null,null,null,null,null,null,null,null,null,null,null,null,null,null,null,null,null,null,null,null,null,null,25.083333331143269,8.2847788539458372E-2]
[null,null,null,null,null,null,null,null,null,null,null,null,null,null,null,null,null,null,null,null,null,null,null,null,null,null,null,null,null,null,null,25.249999997795385,8.9750556237218615E-2]
[null,null,null,null,null,null,null,null,null,null,null,null,null,null,null,null,null,null,null,null,null,null,null,null,null,null,null,null,null,null,null,25.416666664447497,9.5859924703381907E-2]
[null,null,null,null,null,null,null,null,null,null,null,null,null,null,null,null,null,null,null,null,null,null,null,null,null,null,null,null,null,null,null,25.583333331099613,0.10117589393794334]
[null,null,null,null,null,null,null,null,null,null,null,null,null,null,null,null,null,null,null,null,null,null,null,null,null,null,null,null,null,null,null,25.749999997751729,0.10569846394089642]
[null,null,null,null,null,null,null,null,null,null,null,null,null,null,null,null,null,null,null,null,null,null,null,null,null,null,null,null,null,null,null,25.916666664403841,0.1094276347122423]
[null,null,null,null,null,null,null,null,null,null,null,null,null,null,null,null,null,null,null,null,null,null,null,null,null,null,null,null,null,null,null,26.083333331055957,0.1123634062519972]
[null,null,null,null,null,null,null,null,null,null,null,null,null,null,null,null,null,null,null,null,null,null,null,null,null,null,null,null,null,null,null,26.249999997708073,0.11508205385489322]
[null,null,null,null,null,null,null,null,null,null,null,null,null,null,null,null,null,null,null,null,null,null,null,null,null,null,null,null,null,null,null,26.416666664360186,0.12175718881585262]
[null,null,null,null,null,null,null,null,null,null,null,null,null,null,null,null,null,null,null,null,null,null,null,null,null,null,null,null,null,null,null,26.583333331012302,0.13422652480214406]
[null,null,null,null,null,null,null,null,null,null,null,null,null,null,null,null,null,null,null,null,null,null,null,null,null,null,null,null,null,null,null,26.749999997664418,0.15249804788904869]
[null,null,null,null,null,null,null,null,null,null,null,null,null,null,null,null,null,null,null,null,null,null,null,null,null,null,null,null,null,null,null,26.91666666431653,0.17657175807655384]
[null,null,null,null,null,null,null,null,null,null,null,null,null,null,null,null,null,null,null,null,null,null,null,null,null,null,null,null,null,null,null,27.083333330968646,0.20644765536466098]
[null,null,null,null,null,null,null,null,null,null,null,null,null,null,null,null,null,null,null,null,null,null,null,null,null,null,null,null,null,null,null,27.249999997620762,0.24212573975337293]
[null,null,null,null,null,null,null,null,null,null,null,null,null,null,null,null,null,null,null,null,null,null,null,null,null,null,null,null,null,null,null,27.416666664272874,0.28310922957602935]
[null,null,null,null,null,null,null,null,null,null,null,null,null,null,null,null,null,null,null,null,null,null,null,null,null,null,null,null,null,null,null,27.58333333092499,0.31746202944684476]
[null,null,null,null,null,null,null,null,null,null,null,null,null,null,null,null,null,null,null,null,null,null,null,null,null,null,null,null,null,null,null,27.749999997577106,0.3329575732644624]
[null,null,null,null,null,null,null,null,null,null,null,null,null,null,null,null,null,null,null,null,null,null,null,null,null,null,null,null,null,null,null,27.916666664229218,0.329040974690542]
[null,null,null,null,null,null,null,null,null,null,null,null,null,null,null,null,null,null,null,null,null,null,null,null,null,null,null,null,null,null,null,28.083333330881334,0.30571223372504053]
[null,null,null,null,null,null,null,null,null,null,null,null,null,null,null,null,null,null,null,null,null,null,null,null,null,null,null,null,null,null,null,28.24999999753345,0.2631675792191504]
[null,null,null,null,null,null,null,null,null,null,null,null,null,null,null,null,null,null,null,null,null,null,null,null,null,null,null,null,null,null,null,28.416666664185563,0.22117775902827652]
[null,null,null,null,null,null,null,null,null,null,null,null,null,null,null,null,null,null,null,null,null,null,null,null,null,null,null,null,null,null,null,28.583333330837679,0.216170024982519]
[null,null,null,null,null,null,null,null,null,null,null,null,null,null,null,null,null,null,null,null,null,null,null,null,null,null,null,null,null,null,null,28.749999997489795,0.25206714139149361]
[null,null,null,null,null,null,null,null,null,null,null,null,null,null,null,null,null,null,null,null,null,null,null,null,null,null,null,null,null,null,null,28.916666664141907,0.32915854914321141]
[null,null,null,null,null,null,null,null,null,null,null,null,null,null,null,null,null,null,null,null,null,null,null,null,null,null,null,null,null,null,null,29.083333330794023,0.45056664487274362]
[null,null,null,null,null,null,null,null,null,null,null,null,null,null,null,null,null,null,null,null,null,null,null,null,null,null,null,null,null,null,null,29.249999997446139,0.61867786007492631]
[null,null,null,null,null,null,null,null,null,null,null,null,null,null,null,null,null,null,null,null,null,null,null,null,null,null,null,null,null,null,null,29.416666664098251,0.87270413890670839]
[null,null,null,null,null,null,null,null,null,null,null,null,null,null,null,null,null,null,null,null,null,null,null,null,null,null,null,null,null,null,null,29.583333330750367,1.2764828972090887]
[null,null,null,null,null,null,null,null,null,null,null,null,null,null,null,null,null,null,null,null,null,null,null,null,null,null,null,null,null,null,null,29.749999997402483,1.8048521982907617]
[null,null,null,null,null,null,null,null,null,null,null,null,null,null,null,null,null,null,null,null,null,null,null,null,null,null,null,null,null,null,null,29.916666664054596,2.3931021396266883]
[null,null,null,null,null,null,null,null,null,null,null,null,null,null,null,null,null,null,null,null,null,null,null,null,null,null,null,null,null,null,null,30.083333330706711,2.4973357056717607]
[null,null,null,null,null,null,null,null,null,null,null,null,null,null,null,null,null,null,null,null,null,null,null,null,null,null,null,null,null,null,null,30.249999997358827,1.9225486378828645]
[null,null,null,null,null,null,null,null,null,null,null,null,null,null,null,null,null,null,null,null,null,null,null,null,null,null,null,null,null,null,null,30.41666666401094,1.3006088829506488]
[null,null,null,null,null,null,null,null,null,null,null,null,null,null,null,null,null,null,null,null,null,null,null,null,null,null,null,null,null,null,null,30.583333330663056,0.89625419527482442]
[null,null,null,null,null,null,null,null,null,null,null,null,null,null,null,null,null,null,null,null,null,null,null,null,null,null,null,null,null,null,null,30.749999997315172,0.65107521624318399]
[null,null,null,null,null,null,null,null,null,null,null,null,null,null,null,null,null,null,null,null,null,null,null,null,null,null,null,null,null,null,null,30.916666663967284,0.47780170775976849]
[null,null,null,null,null,null,null,null,null,null,null,null,null,null,null,null,null,null,null,null,null,null,null,null,null,null,null,null,null,null,null,31.0833333306194,0.35571868723664779]
[null,null,null,null,null,null,null,null,null,null,null,null,null,null,null,null,null,null,null,null,null,null,null,null,null,null,null,null,null,null,null,31.249999997271516,0.26968385138480933]
[null,null,null,null,null,null,null,null,null,null,null,null,null,null,null,null,null,null,null,null,null,null,null,null,null,null,null,null,null,null,null,31.416666663923628,0.21881269666809935]
[null,null,null,null,null,null,null,null,null,null,null,null,null,null,null,null,null,null,null,null,null,null,null,null,null,null,null,null,null,null,null,31.583333330575744,0.18972480920995394]
[null,null,null,null,null,null,null,null,null,null,null,null,null,null,null,null,null,null,null,null,null,null,null,null,null,null,null,null,null,null,null,31.74999999722786,0.16669765408738055]
[null,null,null,null,null,null,null,null,null,null,null,null,null,null,null,null,null,null,null,null,null,null,null,null,null,null,null,null,null,null,null,31.916666663879973,0.14883215197007402]
[null,null,null,null,null,null,null,null,null,null,null,null,null,null,null,null,null,null,null,null,null,null,null,null,null,null,null,null,null,null,null,32.083333330532085,0.13612830285805455]
[null,null,null,null,null,null,null,null,null,null,null,null,null,null,null,null,null,null,null,null,null,null,null,null,null,null,null,null,null,null,null,32.249999997184204,0.12848686601436729]
[null,null,null,null,null,null,null,null,null,null,null,null,null,null,null,null,null,null,null,null,null,null,null,null,null,null,null,null,null,null,null,32.416666663836317,0.12420282086034509]
[null,null,null,null,null,null,null,null,null,null,null,null,null,null,null,null,null,null,null,null,null,null,null,null,null,null,null,null,null,null,null,32.583333330488429,0.12184110181865952]
[null,null,null,null,null,null,null,null,null,null,null,null,null,null,null,null,null,null,null,null,null,null,null,null,null,null,null,null,null,null,null,32.749999997140549,0.12135696249578826]
[null,null,null,null,null,null,null,null,null,null,null,null,null,null,null,null,null,null,null,null,null,null,null,null,null,null,null,null,null,null,null,32.916666663792661,0.12275040289172072]
[null,null,null,null,null,null,null,null,null,null,null,null,null,null,null,null,null,null,null,null,null,null,null,null,null,null,null,null,null,null,null,33.083333330444773,0.12602142300646196]
[null,null,null,null,null,null,null,null,null,null,null,null,null,null,null,null,null,null,null,null,null,null,null,null,null,null,null,null,null,null,null,33.249999997096893,0.13117002283999624]
[null,null,null,null,null,null,null,null,null,null,null,null,null,null,null,null,null,null,null,null,null,null,null,null,null,null,null,null,null,null,null,33.416666663749005,0.13819618120141258]
[null,null,null,null,null,null,null,null,null,null,null,null,null,null,null,null,null,null,null,null,null,null,null,null,null,null,null,null,null,null,null,33.583333330401118,0.14640112857684265]
[null,null,null,null,null,null,null,null,null,null,null,null,null,null,null,null,null,null,null,null,null,null,null,null,null,null,null,null,null,null,null,33.749999997053237,0.15324677494474701]
[null,null,null,null,null,null,null,null,null,null,null,null,null,null,null,null,null,null,null,null,null,null,null,null,null,null,null,null,null,null,null,33.91666666370535,0.15815703602187484]
[null,null,null,null,null,null,null,null,null,null,null,null,null,null,null,null,null,null,null,null,null,null,null,null,null,null,null,null,null,null,null,34.083333330357462,0.16113191180824638]
[null,null,null,null,null,null,null,null,null,null,null,null,null,null,null,null,null,null,null,null,null,null,null,null,null,null,null,null,null,null,null,34.249999997009581,0.16217140230386268]
[null,null,null,null,null,null,null,null,null,null,null,null,null,null,null,null,null,null,null,null,null,null,null,null,null,null,null,null,null,null,null,34.416666663661694,0.161275507508713]
[null,null,null,null,null,null,null,null,null,null,null,null,null,null,null,null,null,null,null,null,null,null,null,null,null,null,null,null,null,null,null,34.583333330313806,0.15844422742279662]
[null,null,null,null,null,null,null,null,null,null,null,null,null,null,null,null,null,null,null,null,null,null,null,null,null,null,null,null,null,null,null,34.749999996965926,0.15367756204612487]
[null,null,null,null,null,null,null,null,null,null,null,null,null,null,null,null,null,null,null,null,null,null,null,null,null,null,null,null,null,null,null,34.916666663618038,0.14697551137869841]
[null,null,null,null,null,null,null,null,null,null,null,null,null,null,null,null,null,null,null,null,null,null,null,null,null,null,null,null,null,null,null,35.08333333027015,0.13833807542050405]
[null,null,null,null,null,null,null,null,null,null,null,null,null,null,null,null,null,null,null,null,null,null,null,null,null,null,null,null,null,null,null,35.24999999692227,0.12776525417153362]
[null,null,null,null,null,null,null,null,null,null,null,null,null,null,null,null,null,null,null,null,null,null,null,null,null,null,null,null,null,null,null,35.416666663574382,0.11530569902056638]
[null,null,null,null,null,null,null,null,null,null,null,null,null,null,null,null,null,null,null,null,null,null,null,null,null,null,null,null,null,null,null,35.583333330226495,0.10227645274777315]
[null,null,null,null,null,null,null,null,null,null,null,null,null,null,null,null,null,null,null,null,null,null,null,null,null,null,null,null,null,null,null,35.749999996878614,9.011500264408677E-2]
[null,null,null,null,null,null,null,null,null,null,null,null,null,null,null,null,null,null,null,null,null,null,null,null,null,null,null,null,null,null,null,35.916666663530727,7.8894146840654392E-2]
[null,null,null,null,null,null,null,null,null,null,null,null,null,null,null,null,null,null,null,null,null,null,null,null,null,null,null,null,null,null,null,36.083333330182839,6.8613885337464819E-2]
[null,null,null,null,null,null,null,null,null,null,null,null,null,null,null,null,null,null,null,null,null,null,null,null,null,null,null,null,null,null,null,36.249999996834958,5.9274218134539897E-2]
[null,null,null,null,null,null,null,null,null,null,null,null,null,null,null,null,null,null,null,null,null,null,null,null,null,null,null,null,null,null,null,36.416666663487071,5.0875145231870179E-2]
[null,null,null,null,null,null,null,null,null,null,null,null,null,null,null,null,null,null,null,null,null,null,null,null,null,null,null,null,null,null,null,36.583333330139183,4.3416666629462176E-2]
[null,null,null,null,null,null,null,null,null,null,null,null,null,null,null,null,null,null,null,null,null,null,null,null,null,null,null,null,null,null,null,36.749999996791303,3.6898782327309379E-2]
[null,null,null,null,null,null,null,null,null,null,null,null,null,null,null,null,null,null,null,null,null,null,null,null,null,null,null,null,null,null,null,36.916666663443415,3.1321492325412613E-2]
[null,null,null,null,null,null,null,null,null,null,null,null,null,null,null,null,null,null,null,null,null,null,null,null,null,null,null,null,null,null,null,37.083333330095527,2.6684796623765238E-2]
[null,null,null,null,null,null,null,null,null,null,null,null,null,null,null,null,null,null,null,null,null,null,null,null,null,null,null,null,null,null,null,37.249999996747647,2.2988695222395217E-2]
[null,null,null,null,null,null,null,null,null,null,null,null,null,null,null,null,null,null,null,null,null,null,null,null,null,null,null,null,null,null,null,37.416666663399759,2.0233188121271044E-2]
[null,null,null,null,null,null,null,null,null,null,null,null,null,null,null,null,null,null,null,null,null,null,null,null,null,null,null,null,null,null,null,37.583333330051872,1.8418275320395316E-2]
[null,null,null,null,null,null,null,null,null,null,null,null,null,null,null,null,null,null,null,null,null,null,null,null,null,null,null,null,null,null,null,37.749999996703991,1.7543956819786752E-2]
[null,null,null,null,null,null,null,null,null,null,null,null,null,null,null,null,null,null,null,null,null,null,null,null,null,null,null,null,null,null,null,37.916666663356104,1.7610232619434812E-2]
[null,null,null,null,null,null,null,null,null,null,null,null,null,null,null,null,null,null,null,null,null,null,null,null,null,null,null,null,null,null,null,38.083333330008216,1.8617102719341746E-2]
[null,null,null,null,null,null,null,null,null,null,null,null,null,null,null,null,null,null,null,null,null,null,null,null,null,null,null,null,null,null,null,38.249999996660335,2.0564567119494646E-2]
[null,null,null,null,null,null,null,null,null,null,null,null,null,null,null,null,null,null,null,null,null,null,null,null,null,null,null,null,null,null,null,38.416666663312448,2.3356216252526051E-2]
[null,null,null,null,null,null,null,null,null,null,null,null,null,null,null,null,null,null,null,null,null,null,null,null,null,null,null,null,null,null,null,38.58333332996456,2.6296417933168805E-2]
[null,null,null,null,null,null,null,null,null,null,null,null,null,null,null,null,null,null,null,null,null,null,null,null,null,null,null,null,null,null,null,38.74999999661668,2.9079878171368929E-2]
[null,null,null,null,null,null,null,null,null,null,null,null,null,null,null,null,null,null,null,null,null,null,null,null,null,null,null,null,null,null,null,38.916666663268792,3.1705290647934474E-2]
[null,null,null,null,null,null,null,null,null,null,null,null,null,null,null,null,null,null,null,null,null,null,null,null,null,null,null,null,null,null,null,39.083333329920904,3.417265536283752E-2]
[null,null,null,null,null,null,null,null,null,null,null,null,null,null,null,null,null,null,null,null,null,null,null,null,null,null,null,null,null,null,null,39.249999996573024,3.6481972316116634E-2]
[null,null,null,null,null,null,null,null,null,null,null,null,null,null,null,null,null,null,null,null,null,null,null,null,null,null,null,null,null,null,null,39.416666663225136,3.8633241507718241E-2]
[null,null,null,null,null,null,null,null,null,null,null,null,null,null,null,null,null,null,null,null,null,null,null,null,null,null,null,null,null,null,null,39.583333329877249,4.0626462937679256E-2]
[null,null,null,null,null,null,null,null,null,null,null,null,null,null,null,null,null,null,null,null,null,null,null,null,null,null,null,null,null,null,null,39.749999996529368,4.2461636606005396E-2]
[null,null,null,null,null,null,null,null,null,null,null,null,null,null,null,null,null,null,null,null,null,null,null,null,null,null,null,null,null,null,null,39.916666663181481,4.4138762512664444E-2]
[null,null,null,null,null,null,null,null,null,null,null,null,null,null,null,null,null,null,null,null,null,null,null,null,null,null,null,null,null,null,null,40.083333329833593,4.5657840657683371E-2]
[null,null,null,null,null,null,null,null,null,null,null,null,null,null,null,null,null,null,null,null,null,null,null,null,null,null,null,null,null,null,null,40.249999996485712,4.701887104105653E-2]
[null,null,null,null,null,null,null,null,null,null,null,null,null,null,null,null,null,null,null,null,null,null,null,null,null,null,null,null,null,null,null,40.416666663137825,4.8221853662773081E-2]
[null,null,null,null,null,null,null,null,null,null,null,null,null,null,null,null,null,null,null,null,null,null,null,null,null,null,null,null,null,null,null,40.583333329789937,4.9266788522839201E-2]
[null,null,null,null,null,null,null,null,null,null,null,null,null,null,null,null,null,null,null,null,null,null,null,null,null,null,null,null,null,null,null,40.749999996442057,5.015367562127003E-2]
[null,null,null,null,null,null,null,null,null,null,null,null,null,null,null,null,null,null,null,null,null,null,null,null,null,null,null,null,null,null,null,40.916666663094169,5.088251495803349E-2]
[null,null,null,null,null,null,null,null,null,null,null,null,null,null,null,null,null,null,null,null,null,null,null,null,null,null,null,null,null,null,null,41.083333329746281,5.1453306533157397E-2]
[null,null,null,null,null,null,null,null,null,null,null,null,null,null,null,null,null,null,null,null,null,null,null,null,null,null,null,null,null,null,null,41.249999996398401,5.1866050346635245E-2]
[null,null,null,null,null,null,null,null,null,null,null,null,null,null,null,null,null,null,null,null,null,null,null,null,null,null,null,null,null,null,null,41.416666663050513,5.2120746398466984E-2]
[null,null,null,null,null,null,null,null,null,null,null,null,null,null,null,null,null,null,null,null,null,null,null,null,null,null,null,null,null,null,null,41.583333329702626,5.2217394688637966E-2]
[null,null,null,null,null,null,null,null,null,null,null,null,null,null,null,null,null,null,null,null,null,null,null,null,null,null,null,null,null,null,null,41.749999996354745,5.2155995217162833E-2]
[null,null,null,null,null,null,null,null,null,null,null,null,null,null,null,null,null,null,null,null,null,null,null,null,null,null,null,null,null,null,null,41.916666663006858,5.1936547984052256E-2]
[null,null,null,null,null,null,null,null,null,null,null,null,null,null,null,null,null,null,null,null,null,null,null,null,null,null,null,null,null,null,null,42.08333332965897,5.155905298927025E-2]
[null,null,null,null,null,null,null,null,null,null,null,null,null,null,null,null,null,null,null,null,null,null,null,null,null,null,null,null,null,null,null,42.249999996311089,5.1023510232852794E-2]
[null,null,null,null,null,null,null,null,null,null,null,null,null,null,null,null,null,null,null,null,null,null,null,null,null,null,null,null,null,null,null,42.416666662963202,5.0329919714789305E-2]
[null,null,null,null,null,null,null,null,null,null,null,null,null,null,null,null,null,null,null,null,null,null,null,null,null,null,null,null,null,null,null,42.583333329615314,4.9478281435075558E-2]
[null,null,null,null,null,null,null,null,null,null,null,null,null,null,null,null,null,null,null,null,null,null,null,null,null,null,null,null,null,null,null,42.749999996267434,4.846859539370512E-2]
[null,null,null,null,null,null,null,null,null,null,null,null,null,null,null,null,null,null,null,null,null,null,null,null,null,null,null,null,null,null,null,42.916666662919546,4.7313192936234538E-2]
[null,null,null,null,null,null,null,null,null,null,null,null,null,null,null,null,null,null,null,null,null,null,null,null,null,null,null,null,null,null,null,43.083333329571659,4.6124955050639301E-2]
[null,null,null,null,null,null,null,null,null,null,null,null,null,null,null,null,null,null,null,null,null,null,null,null,null,null,null,null,null,null,null,43.249999996223778,4.4964444180639968E-2]
[null,null,null,null,null,null,null,null,null,null,null,null,null,null,null,null,null,null,null,null,null,null,null,null,null,null,null,null,null,null,null,43.41666666287589,4.383223845381988E-2]
[null,null,null,null,null,null,null,null,null,null,null,null,null,null,null,null,null,null,null,null,null,null,null,null,null,null,null,null,null,null,null,43.583333329528003,4.2728337870163322E-2]
[null,null,null,null,null,null,null,null,null,null,null,null,null,null,null,null,null,null,null,null,null,null,null,null,null,null,null,null,null,null,null,43.749999996180122,4.1652742429696674E-2]
[null,null,null,null,null,null,null,null,null,null,null,null,null,null,null,null,null,null,null,null,null,null,null,null,null,null,null,null,null,null,null,43.916666662832235,4.0605452132377436E-2]
[null,null,null,null,null,null,null,null,null,null,null,null,null,null,null,null,null,null,null,null,null,null,null,null,null,null,null,null,null,null,null,44.083333329484347,3.9586466978232107E-2]
[null,null,null,null,null,null,null,null,null,null,null,null,null,null,null,null,null,null,null,null,null,null,null,null,null,null,null,null,null,null,null,44.249999996136467,3.8595786967266163E-2]
[null,null,null,null,null,null,null,null,null,null,null,null,null,null,null,null,null,null,null,null,null,null,null,null,null,null,null,null,null,null,null,44.416666662788579,3.7633412099469077E-2]
[null,null,null,null,null,null,null,null,null,null,null,null,null,null,null,null,null,null,null,null,null,null,null,null,null,null,null,null,null,null,null,44.583333329440691,3.6699342374834992E-2]
[null,null,null,null,null,null,null,null,null,null,null,null,null,null,null,null,null,null,null,null,null,null,null,null,null,null,null,null,null,null,null,44.749999996092811,3.5793577793391075E-2]
[null,null,null,null,null,null,null,null,null,null,null,null,null,null,null,null,null,null,null,null,null,null,null,null,null,null,null,null,null,null,null,44.916666662744923,3.4916118355094804E-2]
[null,null,null,null,null,null,null,null,null,null,null,null,null,null,null,null,null,null,null,null,null,null,null,null,null,null,null,null,null,null,null,45.083333329397036,3.406696405997197E-2]
[null,null,null,null,null,null,null,null,null,null,null,null,null,null,null,null,null,null,null,null,null,null,null,null,null,null,null,null,null,null,null,45.249999996049155,3.3246114908028764E-2]
[null,null,null,null,null,null,null,null,null,null,null,null,null,null,null,null,null,null,null,null,null,null,null,null,null,null,null,null,null,null,null,45.416666662701267,3.2453570899254623E-2]
[null,null,null,null,null,null,null,null,null,null,null,null,null,null,null,null,null,null,null,null,null,null,null,null,null,null,null,null,null,null,null,45.58333332935338,3.1689332033653712E-2]
[null,null,null,null,null,null,null,null,null,null,null,null,null,null,null,null,null,null,null,null,null,null,null,null,null,null,null,null,null,null,null,45.749999996005499,3.0953398311211213E-2]
[null,null,null,null,null,null,null,null,null,null,null,null,null,null,null,null,null,null,null,null,null,null,null,null,null,null,null,null,null,null,null,45.916666662657612,3.0245769731959193E-2]
[null,null,null,null,null,null,null,null,null,null,null,null,null,null,null,null,null,null,null,null,null,null,null,null,null,null,null,null,null,null,null,46.083333329309724,2.9566446295858893E-2]
[null,null,null,null,null,null,null,null,null,null,null,null,null,null,null,null,null,null,null,null,null,null,null,null,null,null,null,null,null,null,null,46.249999995961844,2.8915428002927759E-2]
[null,null,null,null,null,null,null,null,null,null,null,null,null,null,null,null,null,null,null,null,null,null,null,null,null,null,null,null,null,null,null,46.416666662613956,2.8292714853187191E-2]
[null,null,null,null,null,null,null,null,null,null,null,null,null,null,null,null,null,null,null,null,null,null,null,null,null,null,null,null,null,null,null,46.583333329266068,2.7698306846598172E-2]
[null,null,null,null,null,null,null,null,null,null,null,null,null,null,null,null,null,null,null,null,null,null,null,null,null,null,null,null,null,null,null,46.749999995918188,2.7132203983189062E-2]
[null,null,null,null,null,null,null,null,null,null,null,null,null,null,null,null,null,null,null,null,null,null,null,null,null,null,null,null,null,null,null,46.9166666625703,2.6594406262949274E-2]
[null,null,null,null,null,null,null,null,null,null,null,null,null,null,null,null,null,null,null,null,null,null,null,null,null,null,null,null,null,null,null,47.083333329222413,2.608491368588221E-2]
[null,null,null,null,null,null,null,null,null,null,null,null,null,null,null,null,null,null,null,null,null,null,null,null,null,null,null,null,null,null,null,47.249999995874532,2.5603726251984468E-2]
[null,null,null,null,null,null,null,null,null,null,null,null,null,null,null,null,null,null,null,null,null,null,null,null,null,null,null,null,null,null,null,47.416666662526644,2.515084396124545E-2]
[null,null,null,null,null,null,null,null,null,null,null,null,null,null,null,null,null,null,null,null,null,null,null,null,null,null,null,null,null,null,null,47.583333329178757,2.4726266813689689E-2]
[null,null,null,null,null,null,null,null,null,null,null,null,null,null,null,null,null,null,null,null,null,null,null,null,null,null,null,null,null,null,null,47.749999995830876,2.4329994809303312E-2]
[null,null,null,null,null,null,null,null,null,null,null,null,null,null,null,null,null,null,null,null,null,null,null,null,null,null,null,null,null,null,null,47.916666662482989,2.396202794808637E-2]
[null,null,null,null,null,null,null,null,null,null,null,null,null,null,null,null,null,null,null,null,null,null,null,null,null,null,null,null,null,null,null,48.083333329135101,2.3622366230041925E-2]
[null,null,null,null,null,null,null,null,null,null,null,null,null,null,null,null,null,null,null,null,null,null,null,null,null,null,null,null,null,null,null,48.249999995787221,2.3311009655166914E-2]
[null,null,null,null,null,null,null,null,null,null,null,null,null,null,null,null,null,null,null,null,null,null,null,null,null,null,null,null,null,null,null,48.416666662439333,2.3027958223461379E-2]
[null,null,null,null,null,null,null,null,null,null,null,null,null,null,null,null,null,null,null,null,null,null,null,null,null,null,null,null,null,null,null,48.583333329091445,2.2773211934917603E-2]
[null,null,null,null,null,null,null,null,null,null,null,null,null,null,null,null,null,null,null,null,null,null,null,null,null,null,null,null,null,null,null,48.749999995743565,2.2546770789564616E-2]
[null,null,null,null,null,null,null,null,null,null,null,null,null,null,null,null,null,null,null,null,null,null,null,null,null,null,null,null,null,null,null,48.916666662395677,2.2348634787359819E-2]
[null,null,null,null,null,null,null,null,null,null,null,null,null,null,null,null,null,null,null,null,null,null,null,null,null,null,null,null,null,null,null,49.08333332904779,2.2178803928348697E-2]
[null,null,null,null,null,null,null,null,null,null,null,null,null,null,null,null,null,null,null,null,null,null,null,null,null,null,null,null,null,null,null,49.249999995699909,2.2037278212485762E-2]
[null,null,null,null,null,null,null,null,null,null,null,null,null,null,null,null,null,null,null,null,null,null,null,null,null,null,null,null,null,null,null,49.416666662352021,2.1924057639803003E-2]
[null,null,null,null,null,null,null,null,null,null,null,null,null,null,null,null,null,null,null,null,null,null,null,null,null,null,null,null,null,null,null,49.583333329004134,2.183914221029257E-2]
[null,null,null,null,null,null,null,null,null,null,null,null,null,null,null,null,null,null,null,null,null,null,null,null,null,null,null,null,null,null,null,49.749999995656253,2.1782531923962321E-2]
[null,null,null,null,null,null,null,null,null,null,null,null,null,null,null,null,null,null,null,null,null,null,null,null,null,null,null,null,null,null,null,49.916666662308366,2.1754226780780279E-2]

{"sheet":"Database","index":11,"n_rows":301,"n_cols":26,"rows_kept":301,"cut":false,"hidden":false,"merged":[]}
[null,"           ","                Database of dissociation constants of acids / protonation constants of bases"]
[null,"Most constants in this compilation of ~250 systems – but not all – were obtained at 25o C and are thermodynamic ones (I=0), as required by the pH_calc, Simulation and Regression modules."]
[null,"No guarantee is given that the compiled pKas or the calculations made with CurTiPot are correct or accurate. CurTiPot takes in account only protonation equilibria but other chemical reactions will occur for many combinations of two or more of the listed systems. "]
[null,"More systems, e.g., from the sources given next,  can be added: a) at the end of the list; b) in alphabetic order by inserting line(s) and updating the sequential numbering (column B)."]
[null,"Larger compilations of equilibrium constants and examples of on-line literature on acid-base equilibrium"]
[null,"Mini-SCDatabase - Stability (equilibrium) constants with temperature and ionic stregth effect correction ",null,null,null,null,null,null,"http://www.acadsoft.co.uk/scdbase/scdbase.htm",null,null,null,"Tutorial on acids and bases (and other) equilibria",null,null,null,null,null,"http://www.asdlib.org/onlineArticles/ecourseware/Text_Files_files/Chapter6.pdf"]
[null,"Dissociation constants of  inorganic and organic compounds (compilation with 33 pages)",null,null,null,null,null,"https://www.chem.wisc.edu/areas/reich/pkatable/pKa_compilation-1-Williams.pdf",null,null,null,null,"Tutorial on titrations of acids and bases",null,null,null,null,null,"http://www.asdlib.org/onlineArticles/ecourseware/Text_Files_files/Chapter9.pdf"]
[null,"Dissociation constants of organic compounds (~600 compounds)",null,null,null,null,null,"http://www.zirchrom.com/organic.htm",null,null,null,null,"Measurement of pH. Definitions, Standards and Procedures (IUPAC - 2002) ",null,null,null,null,null,"http://www.iupac.org/publications/pac/2002/pdf/7411x2169.pdf"]
[null,"Computer calculated pKa values of any compound (by chemical name, CAS #, etc.) ",null,null,null,null,null,"http://www.chemicalize.org/",null,null,null,null,"Temperature dependence of potassium hydrogen phtalate 0.05 mol/kg buffer",null,null,null,null,null,"http://nvl.nist.gov/pub/nistpubs/jres/081/1/V81.N01.A03.pdf"]
[null,"Martell, A. E., Smith, R. M., Critical Stability Constants, Vol. 1–4. Plenum Press: New York, 1976.",null,null,null,null,null,null,null,null,null,null,"Primary standard buffer solutions pH at various temperatures",null,null,null,null,null,"http://nvl.nist.gov/pub/nistpubs/jres/066/2/V66.N02.A06.pdf"]
[null,"Perrin, D. D., Dissociation Constants of Organic Bases in Aqueous Solution, Butterworths, London, 1965; Supplement, 1972.",null,null,null,null,null,null,null,null,null,null,"Water,  hydrogen ion, hydroxide ion structures, properties, Kw, pH ",null,null,null,null,null,"http://www1.lsbu.ac.uk/water/hydrogen_ions.html"]
[null,"Serjeant, E. P., and Dempsey, B., Ionization Constants of Organic Acids in Aqueous Solution, Pergamon, Oxford, 1979.",null,null,null,null,null,null,null,null,null,null,"Buffer Reference Center",null,null,"https://www.sigmaaldrich.com/life-science/core-bioreagents/biological-buffers/learning-center/buffer-reference-center.html"]
[null,"Albert, A., \"Ionization Constants of Heterocyclic Substances\", in Physical Methods in Heterocyclic Chemistry, Katritzky, A. R., Ed., Academic Press, New York, 1963. ",null,null,null,null,null,null,null,null,null,null,"Online Buffer Calculator",null,null,"http://www.sigmaaldrich.com/life-science/core-bioreagents/biological-buffers/learning-center/buffer-calculator.html"]
[null,"Perrin, D. D., Dempsey, B., and Serjeant, E. P., pKa Prediction for Organic Acids and Bases, Chapman & Hall, London, 1981.",null,null,null,null,null,null,null,null,null,null,"Biological Buffers (with temperature dependence calculator)",null,null,null,null,null,"http://www.reachdevices.com/Protein/BiologicalBuffers.html"]
[null,"Dawson, R. M. C., Elliot, D. C., Elliot, W. H., and Jones, K. M., Data for Biochemical Research, Oxford Science Publications, Oxford, 1986.",null,null,null,null,null,null,null,null,null,null,"Conversion of dissociation constants of acids into protonation constants of their conjugated bases"]
[null,"Acid base indicators - pKas, color transitions, etc.",null,null,null,null,null,null,null,null,null,null,"pKa1 = logKpn","pKa4 = logKpn-3",null,"Overall (global) protonation constants"]
[null,"Estimation of activity coefficients, gi, within CurTiPot - Davies equation:",null,null,null,null,null,null,null,"Ionic strength =",null,null,"pKa2 = logKpn-1","pKa5 = logKpn-4",null,"logbp,i = logSKp and bp,i = PKp"]
[null,null,null,null,null,null,null,null,null,null,null,null,"pKa3 = logKpn-2","pKa6 = logKpn-5"]
[null,null,"Acid or Base","Charge, fully",null,null,null,null,null,null,"Temperat.","Ionic",null,"Molar mass"]
[null,null,null,"deprotonated","pKa1","pKa2","pKa3","pKa4","pKa5","pKa6","ºC","strength","  Formula","g/mol"]
[null,null,"F R E Q U E N T L Y    U S E D "]
[null,1,"Acetic acid",-1,4.7569999999999997,null,null,null,null,null,25,0,"CH3COOH",60.052]
[null,2,"Ammonia",0,9.2439999999999998,null,null,null,null,null,25,0,"NH3",17.026]
[null,3,"Carbonic acid",-2,6.3520000000000003,10.329000000000001,null,null,null,null,25,0,"H2CO3"]
[null,4,"Citric acid",-3,3.1280000000000001,4.7610000000000001,6.3959999999999999,null,null,null,25,0,"H3C6H5O7 ",192.02699999999999]
[null,5,"EDTA",-4,-0.21,1.5,2.21,3.11,6.75,11.03,25,0,"C10H16N2O8",292.08999999999997]
[null,6,"HCl",-1,-7,null,null,null,null,null,25,0,"HCl"]
[null,7,"Hydroxide ion",-1,13.997,null,null,null,null,null,25,0,"NaOH"]
[null,8,"Phosphoric acid",-3,2.1480000000000001,7.1989999999999998,12.35,null,null,null,25,0,"H3PO4",97.975999999999999]
[null,9,null,0,0]
[null,10,null,0,0]
[null,11,"A L P H A B E T I C   O R D E R ",null,"   Insert new lines anywere to add more systems; renumber column B",null,null,null,null,null,"Find more values in the references and links"]
[null,12,"Acetamide ",0,0.63,null,null,null,null,null,25,0,"C2H5NO ",59.067]
[null,13,"Acetic acid",-1,4.7569999999999997,null,null,null,null,null,25,0,"CH3COOH",60.052]
[null,14,"Acetoacetic acid ",-1,3.58,null,null,null,null,null,18,0,"C4H6O3 ",102.089]
[null,15,"Acrylic acid ",-1,4.25,null,null,null,null,null,25,0,"C3H4O2 ",72.063000000000002]
[null,16,"Adipic acid ",-2,4.43,5.41,null,null,null,null,25,0,"C6H10O4 ",146.143]
[null,17,"Alanine ",-1,2.3479999999999999,9.8670000000000009,null,null,null,null,25,0,"C3H7NO2",89.093999999999994]
[null,18,"Aminobenzene = aniline",0,4.5999999999999996,null,null,null,null,null,25,0,"C6H7N",93.13]
[null,19,"2-Aminobenzoic acid ",-1,2.1080000000000001,4.9459999999999997,null,null,null,null,25,0,"C7H7NO2 ",137.13800000000001]
[null,20,"4-Animobenzoic acid ",-1,2.5009999999999999,4.8739999999999997,null,null,null,null,25,0,"C7H7NO2 ",137.13800000000001]
[null,21,"2-Aminobutanoic acid ",-1,2.29,9.83,null,null,null,null,25,0,"C4H9NO2 "]
[null,22,"6-Aminohexanoic acid ",-1,4.3730000000000002,10.804,null,null,null,null,25,0,"C6H13NO2 "]
[null,23,"5-Aminopentanoic acid ",-1,4.2699999999999996,10.766,null,null,null,null,25,0,"C5H11NO2 "]
[null,24,"2-Aminophenol",-1,4.78,9.9700000000000006,null,null,null,null,20,0,"C6H7NO"]
[null,25,"b-Alanine ",-1,3.55,10.24,null,null,null,null,25,0,"C3H7NO2 "]
[null,26,"Ammonia",0,9.2439999999999998,null,null,null,null,null,25,0,"NH3",17.026]
[null,27,"Aniline ",0,4.63,null,null,null,null,null,25,0,"C6H7N "]
[null,28,"Arginine",-1,1.823,8.9909999999999997,12.48,null,null,null,25,0,"C6H14N4O2 "]
[null,29,"Arsenic acid ",-3,2.2400000000000002,6.96,11.5,null,null,null,25,0,"H3AsO4 "]
[null,30,"Arsenous acid",-1,9.2200000000000006,null,null,null,null,null,null,0,"H3AsO3 "]
[null,31,"Ascorbic acid ",-2,4.0999999999999996,11.79,null,null,null,null,24,0,"C6H8O6 "]
[null,32,"Asparagine",-1,2.14,8.93,null,null,null,null,25,0,"C4H8N2O3 "]
[null,33,"Aspartic acid ",-2,1.99,3.9,10.002000000000001,null,null,null,25,0,"C4H7NO4 "]
[null,34,"Barbital",0,7.43,null,null,null,null,null,25,0,"C8H12N2O3 ",184.19]
[null,35,"Barbituric acid ",-1,4.01,null,null,null,null,null,25,0,"C4H4N2O3 ",128.09]
[null,36,"Benzenesulfonic acid ",-1,0.7,null,null,null,null,null,25,0,"C6H6O3S "]
[null,37,"Benzoic acid ",-1,4.1900000000000004,null,null,null,null,null,25,0,"C7H6O2 "]
[null,38,"Benzylamine ",0,9.33,null,null,null,null,null,25,0,"C7H9N "]
[null,39,"2-Benzylpyridine ",0,5.13,null,null,null,null,null,25,0,"C12H11N "]
[null,40,"Betaine ",-1,1.83,null,null,null,null,null,0,0,"C5H11NO2 "]
[null,41,"Boric acid ",-3,9.2360000000000007,12.74,13.8,null,null,null,20,0,"H3BO3"]
[null,42,"Butanoic acid ",-1,4.83,null,null,null,null,null,25,0,"C4H8O2 "]
[null,43,"3-Butenoic acid ",-1,4.34,null,null,null,null,null,25,0,"C4H6O2 "]
[null,44,"Butylamine ",0,10.77,null,null,null,null,null,20,0,"C4H11N "]
[null,45,"sec-Butylamine ",0,10.56,null,null,null,null,null,25,0,"C4H11N "]
[null,46,"tert-Butylamine ",0,10.68,null,null,null,null,null,25,0,"C4H11N "]
[null,47,"Cadaverine ",0,10.050000000000001,10.93,null,null,null,null,25,0,"C5H14N2 "]
[null,48,"Carbonic acid",-2,6.3520000000000003,10.329000000000001,null,null,null,null,25,0,"H2CO3"]
[null,49,"Catechol",-2,9.4,12.8,null,null,null,null,25,0,"C6H4(OH)2",110.1]
[null,50,"Chloroacetic acid",-1,2.8650000000000002,null,null,null,null,null,25,0,"ClCH2COOH"]
[null,51,"2-Chloroaniline ",0,2.65,null,null,null,null,null,25,0,"C6H6CIN "]
[null,52,"3-Chloroaniline ",0,3.46,null,null,null,null,null,25,0,"C6H6CIN "]
[null,53,"4-Chloroaniline ",0,4.1500000000000004,null,null,null,null,null,25,0,"C6H6CIN "]
[null,54,"2-Chlorobenzoic acid ",-1,2.92,null,null,null,null,null,25,0,"C7H5CIO2 "]
[null,55,"3-Chlorobenzoic acid ",-1,3.82,null,null,null,null,null,25,0,"C7H5CIO2 "]
[null,56,"4-Chlorobenzoic acid ",-1,3.98,null,null,null,null,null,25,0,"C7H5CIO2 "]
[null,57,"3-Chlorophenol ",-1,8.85,null,null,null,null,null,25,0,"C6H5CIO "]
[null,58,"4-Chlorophenol ",-1,9.18,null,null,null,null,null,25,0,"C6H5CIO "]
[null,59,"2-Chlorophenol ",-1,8.49,null,null,null,null,null,25,0,"C6H5CIO "]
[null,60,"Choline ",0,13.9,null,null,null,null,null,25,0,"C5H14NO "]
[null,61,"Chromic acid",-2,-0.2,6.51,null,null,null,null,20,0,"H2CrO4"]
[null,62,"Citric acid",-3,3.1280000000000001,4.7610000000000001,6.3959999999999999,null,null,null,25,0,"H3C6H5O7 "]
[null,63,"Codeine ",0,8.2100000000000009,null,null,null,null,null,25,0,"C18H21NO3 "]
[null,64,"Creatinine ",0,4.83,9.1999999999999993,null,null,null,null,25,0,"C4H7N3O "]
[null,65,"m-Cresol ",-1,10.01,null,null,null,null,null,25,0,"C7H8O "]
[null,66,"O-Cresol ",-1,10.199999999999999,null,null,null,null,null,25,0,"C7H8O "]
[null,67,"p-Cresol ",-1,10.17,null,null,null,null,null,25,0,"C7H8O "]
[null,68,"Cupferron",-1,4.37,null,null,null,null,null,25,0,"C6H6N2O"]
[null,69,"Cyanic acid",-1,3.46,null,null,null,null,null,null,null,"HCNO "]
[null,70,"Cysteine ",-2,1.71,8.36,10.77,null,null,null,25,0,"C3H7NO2S "]
[null,71,"Decylamine ",0,10.64,null,null,null,null,null,25,0,"C10H23N "]
[null,72,"2,4-Diaminobutanoic acid ",-1,1.85,8.24,10.44,null,null,null,25,0,"C4H10N2O2 "]
[null,73,"Dichloroacetic acid",-1,1.3,null,null,null,null,null,25,0,"Cl2CHCOOH"]
[null,74,"2,3-Dichlorophenol ",-1,7.46,null,null,null,null,null,25,0,"C6H4Cl2O "]
[null,75,"Diethylamine",0,10.933,null,null,null,null,null,25,0,"(CH3CH2)2NH"]
[null,76,"Diisopropylamine ",0,11.05,null,null,null,null,null,25,0,"C6H15N "]
[null,77,"Dimethylamine",0,10.773999999999999,null,null,null,null,null,25,0,"(CH3)2NH"]
[null,78,"Dimethylglyoxime",-2,10.66,12,null,null,null,null,25,0,"C4H12O2N2"]
[null,79,"2,3-Dimethylpyridine ",0,6.58,null,null,null,null,null,25,0,"C7H9N "]
[null,80,"2,4-Dimethylpyridine ",0,6.99,null,null,null,null,null,25,0,"C7H9N "]
[null,81,"2,5-Dmethylpyridine ",0,6.4,null,null,null,null,null,25,0,"C7H9N "]
[null,82,"2,6-Dimethylpyridine ",0,6.65,null,null,null,null,null,25,0,"C7H9N "]
[null,83,"3,4-Dimethylpyridine ",0,6.46,null,null,null,null,null,25,0,"C7H9N "]
[null,84,"3.5-Dimethylpyridine ",0,6.15,null,null,null,null,null,25,0,"C7H9N "]
[null,85,"Dinicotinic acid ",-1,2.8,null,null,null,null,null,25,0,"C7H5NO4 "]
[null,86,"Diphenylamine ",0,0.79,null,null,null,null,null,25,0,"C12H11N "]
[null,87,"Dipicolinic acid ",-2,2.16,4.76,null,null,null,null,25,0,"C7H5NO4 "]
[null,88,"Dopamine ",-1,8.9,10.6,null,null,null,null,25,0,"C8H11NO2 ",153.18]
[null,89,"d-Ephedrine ",0,10.138999999999999,null,null,null,null,null,10,0,"C10H15NO ",165.23]
[null,90,"Ethanolamine ",0,9.5,null,null,null,null,null,25,0,"C2H7NO "]
[null,91,"Ethylamine",0,10.635999999999999,null,null,null,null,null,25,0,"CH3CH2NH2"]
[null,92,"Ethylenediamine",0,6.8479999999999999,9.9280000000000008,null,null,null,null,25,0,"H2NCH2CH2NH2"]
[null,93,"Ethylenediaminetetraacetic acid (EDTA)",-4,-0.21,1.5,2.21,3.11,6.75,11.03,25,0,"C10H16N2O8"]
[null,94,"Ethyleneimine ",0,8.01,null,null,null,null,null,25,0,"C2H5N "]
[null,95,"2-Ethylpyridine ",0,5.89,null,null,null,null,null,25,0,"C7H9N "]
[null,96,"Formic acid ",-1,3.7450000000000001,null,null,null,null,null,20,0,"HCOOH"]
[null,97,"Fumaric acid",-2,3.0529999999999999,4.4939999999999998,null,null,null,null,25,0,"C4H4O4 ",116.07]
[null,98,"L-Glutamic acid ",-2,2.23,4.42,9.9499999999999993,null,null,null,25,0,"C5H9NO4 ",147.13]
[null,99,"L-Glutamine ",-1,2.17,9.1300000000000008,null,null,null,null,25,0,"C5H10N2O3 ",146.15]
[null,100,"L-Glutathione ",-2,2.12,3.59,8.75,9.65,null,null,25,0,"C10H17N3O6S "]
[null,101,"Glyceric acid ",-1,3.52,null,null,null,null,null,25,0,"C3H6O4 "]
[null,102,"Glycerol ",-1,14.15,null,null,null,null,null,25,0,"C3H8O3 "]
[null,103,"Glycine",-1,2.35,9.7780000000000005,null,null,null,null,25,0,"H2NCH2COOH",75.069999999999993]
[null,104,"Glycolic acid",-1,3.831,null,null,null,null,null,25,0,"HOCH2COOH"]
[null,105,"Glyoxylic acid",-1,3.18,null,null,null,null,null,25,0,"C2H2O3 "]
[null,106,"Heptanedioic acid ",-1,4.71,null,null,null,null,null,25,0,"C7H12O4 "]
[null,107,"Heptanoic acid ",-1,4.8899999999999997,null,null,null,null,null,25,0,"C7H14O2 "]
[null,108,"Heptylamine ",0,10.67,null,null,null,null,null,25,0,"C7H17N "]
[null,109,"Hexamethylenediamine ",0,11.856999999999999,10.762,null,null,null,null,0,0,"C6H16N2 "]
[null,110,"Hexanoic acid ",-1,4.8499999999999996,null,null,null,null,null,25,0,"C6H12O2 "]
[null,111,"Hexylamine ",0,10.56,null,null,null,null,null,25,0,"C6H15N "]
[null,112,"Histamine ",0,6.04,9.75,null,null,null,null,25,0,"C5H9N3 "]
[null,113,"Histidine",-1,1.49,6.02,9.2899999999999991,null,null,null,25,0,"C6H9N3O2 "]
[null,114,"Hydrazine",0,8.07,null,null,null,null,null,30,null,"N2H4"]
[null,115,"Hydroazoic ",-1,4.72,null,null,null,null,null,null,null,"HN3 "]
[null,116,"Hydrogen bromide",-1,-9,null,null,null,null,null,25,0,"HI"]
[null,117,"Hydrogen chloride",-1,-7,null,null,null,null,null,25,0,"HCl"]
[null,118,"Hydrogen chromate ion ",-1,6.52,null,null,null,null,null,null,null,"HCrO4- "]
[null,119,"Hydrogen cyanide",-1,9.2100000000000009,null,null,null,null,null,25,0,"HCN"]
[null,120,"Hydrogen fluoride",-1,3.17,null,null,null,null,null,25,0,"HF"]
[null,121,"Hydrogen peroxide",-1,11.65,null,null,null,null,null,25,0,"H2O2"]
[null,122,"Hydrogen selenate ion ",-1,1.66,null,null,null,null,null,null,null,"HSeO4- "]
[null,123,"Hydrogen sulfide",-2,7.02,13.9,null,null,null,null,25,0,"H2S"]
[null,124,"Hydrogen thiocyanate ",-1,0.9,null,null,null,null,null,25,0,"HSCN"]
[null,125,"Hydroquinone ",0,10.35,null,null,null,null,null,20,null,"C6H6O2 "]
[null,126,"Hydroxylamine",0,5.96,null,null,null,null,null,25,0,"NH2OH"]
[null,127,"m-Hydroxybenzoic acid ",-2,4.0599999999999996,9.92,null,null,null,null,19,0,"C7H6O3 "]
[null,128,"p-Hydroxybenzoic acid ",-2,4.4800000000000004,9.32,null,null,null,null,19,0,"C7H6O3 "]
[null,129,"3-Hydroxypropanoic acid ",-1,4.51,null,null,null,null,null,25,0,"C3H6O3 "]
[null,130,"8-Hydroxyquinoline",-1,4.91,9.81,null,null,null,null,25,0]
[null,131,"Hypobromous",-1,8.6300000000000008,null,null,null,null,null,25,0,"HOBr"]
[null,132,"Hypochlorous",-1,7.53,null,null,null,null,null,25,0,"HOCl"]
[null,133,"Hypoiodous",-1,10.64,null,null,null,null,null,25,0,"HOI"]
[null,134,"Imidazole ",0,6.9530000000000003,null,null,null,null,null,25,0,"C3H4N2 ",68.08]
[null,135,"Iodic acid",-1,0.77,null,null,null,null,null,25,0,"HIO3"]
[null,136,"Isocitric acid ",-3,3.29,4.71,6.4,null,null,null,25,0,"C6H8O7 "]
[null,137,"Isoleucine",-1,2.319,9.7539999999999996,null,null,null,null,25,0,"C6H13NO2 ",131.18]
[null,138,"Lactic acid",-1,3.86,null,null,null,null,null,null,null,"HC3H5O3 "]
[null,139,"l-Ephedrine ",0,9.9580000000000002,null,null,null,null,null,10,0,"C10H15NO ",165.23]
[null,140,"l-Leucine ",-1,2.3279999999999998,9.7439999999999998,null,null,null,null,25,0,"C6H13NO2 "]
[null,141,"Lysine ",-1,1.83,9.08,10.9,null,null,null,25,0,"C6H14N2O2 "]
[null,142,"Maleic acid ",-2,1.91,6.3319999999999999,null,null,null,null,25,0,"C4H4O4 "]
[null,143,"Malic acid ",-2,3.4590000000000001,5.0970000000000004,null,null,null,null,25,0,"C4H6O5 "]
[null,144,"Malonic acid",-2,2.847,5.6959999999999997,null,null,null,null,25,0,"HOOCCH2COOH"]
[null,145,"Melamine = 1,3,5-triazine-2,4,6-triamine",0,5,null,null,null,null,null,25,0,"C3H6N6 "]
[null,146,"Methionine = (S)-2-amino-4-(methylsulfanyl)-butanoic acid",-1,2.13,9.27,null,null,null,null,25,0,"C5H11NO2S "]
[null,147,"Methylamine ",0,10.63,null,null,null,null,null,25,0,"CH5N ",31.1]
[null,148,"2-Methylaniline = o-touidine = 2-amino-1-methylbenzene",0,4.4470000000000001,null,null,null,null,null,25,0,"C7H9N","107.17"]
[null,149,"4-Methylaniline = p-toluidine = 4-amino-1-methylbenzene",0,5.0839999999999996,null,null,null,null,null,25,0,"C7H9N","107.17"]
[null,150,"2-Methylbenzimidazole ",0,6.19,null,null,null,null,null,25,0,"C8H8N2 "]
[null,151,"2-Methylbutanoic acid ",-1,4.8,null,null,null,null,null,25,0,"C5H10O2 "]
[null,152,"3-Methylbutanoic acid ",-1,4.7699999999999996,null,null,null,null,null,25,0,"C5H10O2 "]
[null,153,"Methylmalonic acid ",-2,3.07,5.76,null,null,null,null,25,0,"C4H6O4 "]
[null,154,"Methyl-1-naphthylamine ",0,3.67,null,null,null,null,null,27,0,"C11H11N "]
[null,155,"4-Methylpentanoic acid ",-1,4.84,null,null,null,null,null,18,0,"C6H12O2 "]
[null,156,"1-Methylpiperidine ",0,10.08,null,null,null,null,null,25,0,"C6H13N "]
[null,157,"2-Methylphenol = o-cresol",-1,10.28,null,null,null,null,null,25,0,"C7H8O ","108.14"]
[null,158,"4-Methylphenol = p-cresol",-1,10.26,null,null,null,null,null,25,0,"C7H8O ","108.14"]
[null,159,"2-Methylpyridine ",0,5.97,null,null,null,null,null,20,0,"C6H7N "]
[null,160,"3-Methylpyridine ",0,5.68,null,null,null,null,null,20,0,"C6H7N "]
[null,161,"4-Methylpyridine ",0,6.02,null,null,null,null,null,20,0,"C6H7N "]
[null,162,"Morphine ",0,8.2100000000000009,null,null,null,null,null,25,0,"C17H19NO3 "]
[null,163,"Morpholine ",0,8.33,null,null,null,null,null,25,0,"C4H9NO "]
[null,164,"2-(N-morpholino)ethanesulfonic acid - MES",-1,6.2,null,null,null,null,null,25,0,"C6H13NO4S ",195.2]
[null,165,"1-Naphthol ",-1,9.34,null,null,null,null,null,25,0,"C10H8O "]
[null,166,"2-Naphthol ",-1,9.51,null,null,null,null,null,25,0,"C10H8O "]
[null,167,"Nicotine ",0,3.12,8.02,null,null,null,null,25,0,"C10H14N2 "]
[null,168,"Nitrilotriacetic acid",-3,1.1000000000000001,1.65,2.94,10.334,null,null,20,0,"C6H9NO6",191.11]
[null,169,"2-Nitroaniline ",0,-0.26,null,null,null,null,null,25,0,"C6H6N2O2 "]
[null,170,"3-Nitroaniline ",0,2.4660000000000002,null,null,null,null,null,25,0,"C6H6N2O2 "]
[null,171,"4-Nitroaniline ",0,1,null,null,null,null,null,25,0,"C6H6N2O2 "]
[null,172,"2-Nitrobenzoic acid",-1,2.1789999999999998,null,null,null,null,null,25,0,"C7H5NO4 "]
[null,173,"2-Nitrophenol",-1,7.21,null,null,null,null,null,25,0,"C6H5NO3 "]
[null,174,"3-Nitrophenol",-1,8.39,null,null,null,null,null,25,0,"C6H5NO3 "]
[null,175,"4-Nitrophenol ",-1,7.15,null,null,null,null,null,25,0,"C6H5NO3 "]
[null,176,"3-Nitrobenzoic acid",-1,3.4489999999999998,null,null,null,null,null,25,0,"C7H5NO4 "]
[null,177,"4-Nitrobenzoic acid ",-1,3.4420000000000002,null,null,null,null,null,25,0,"C7H5NO4 "]
[null,178,"Nitrous acid",-1,3.15,null,null,null,null,null,25,0,"HNO2"]
[null,179,"Noradrenaline ",-1,8.64,9.6999999999999993,null,null,null,null,25,0,"C8H11NO3 "]
[null,180,"Octadecylamine ",0,10.6,null,null,null,null,null,25,0,"C18H39N "]
[null,181,"Octanedioic acid ",-1,4.5199999999999996,null,null,null,null,null,25,0,"C8H14O4 "]
[null,182,"Octanoic acid ",-1,4.8899999999999997,null,null,null,null,null,25,0,"C8H16O2 "]
[null,183,"Oxalic acid",-2,1.252,4.266,null,null,null,null,25,0,"C2H2O4 "]
[null,184,"Oxaloacetic acid ",-2,2.2200000000000002,3.89,13.03,null,null,null,25,0,"C4H4O5 "]
[null,185,"Papaverine ",0,6.4,null,null,null,null,null,25,0,"C20H21NO4 "]
[null,186,"Paracetamol = acetaminophen",0,9.51,null,null,null,null,null,25,0,"C8H9NO2 ",151.16999999999999]
[null,187,"Pentanoic acid ",-1,4.84,null,null,null,null,null,25,0,"C5H10O2 "]
[null,188,"Perchloric acid",-1,-10,null,null,null,null,null,25,0,"HClO4"]
[null,189,"p-Periodic acid",-2,1.55,8.2799999999999994,null,null,null,null,null,null,"H5IO6 "]
[null,190,"1,10-Phenanthroline ",0,4.84,null,null,null,null,null,25,0,"C12H8N2 ",180.3]
[null,191,"m-Phenetidine ",0,4.18,null,null,null,null,null,25,0,"C8H11NO "]
[null,192,"o-Phenetidine ",0,4.43,null,null,null,null,null,28,0,"C8H11NO "]
[null,193,"Phenol",-1,9.98,null,null,null,null,null,25,0,"HC6H5O "]
[null,194,"Phenylacetic acid ",-1,4.28,null,null,null,null,null,18,0,"C8H8O2 "]
[null,195,"Phenylalanine ",-1,2.2000000000000002,9.31,null,null,null,null,25,0,"C9H11NO2 "]
[null,196,"Phenylethylamine ",0,9.84,null,null,null,null,null,25,0,"C8H11N "]
[null,197,"Phenylglycine ",-1,1.83,4.3899999999999997,null,null,null,null,25,0,"C8H9NO2 "]
[null,198,"Phosphoric acid",-3,2.1480000000000001,7.1989999999999998,12.35,null,null,null,25,0,"H3PO4"]
[null,199,"m-Phthalic acid ",-2,3.7,4.5999999999999996,null,null,null,null,25,0,"C8H6O4 ",166.14]
[null,200,"o-Phthalic acid",-2,2.76,4.96,null,null,null,null,25,0,"C8H6O4 ",166.14]
[null,201,"p-Phthalic acid ",-2,3.54,4.46,null,null,null,null,25,0,"C8H6O4 "]
[null,202,"Picolinic acid ",-2,1.07,5.25,null,null,null,null,25,0,"C6H5NO2 "]
[null,203,"Picric acid ",-1,0.38,null,null,null,null,null,null,null,"C6H3N3O7 "]
[null,204,"Pilocarpine ",0,6.87,null,null,null,null,null,30,0,"C11H16N2O2 ",208.25899999999999]
[null,205,"Piperazine ",0,5.56,9.83,null,null,null,null,23,0,"C4H10N2 "]
[null,206,"Piperidine",0,7.53,11.122999999999999,null,null,null,null,25,0,"C5H11N",85.15]
[null,207,"p-Phenetidine ",0,5.2,null,null,null,null,null,28,0,"C8H11NO "]
[null,208,"Proline",-1,1.952,10.64,null,null,null,null,25,0,"C5H9NO2",115.13]
[null,209,"Propanoic acid",-1,4.8739999999999997,null,null,null,null,null,25,0,"CH3CH2COOH"]
[null,210,"Propylamine",0,10.566000000000001,null,null,null,null,null,25,0,"CH3CH2CH2NH2"]
[null,211,"Purine ",0,2.2999999999999998,8.9600000000000009,null,null,null,null,20,0,"C5H4N4 ",120.11]
[null,212,"Pyridine",0,5.2290000000000001,null,null,null,null,null,25,0,"C5H5N",79.099999999999994]
[null,213,"3-Pyridinecarboxylic acid ",-1,4.8499999999999996,null,null,null,null,null,25,0,"C6H5NO2 "]
[null,214,"4-Pyridinecarboxylic acid ",-1,4.96,null,null,null,null,null,25,0,"C6H5NO2 "]
[null,215,"Pyrimidine ",0,1.1000000000000001,null,null,null,null,null,20,0,"C2H4N2 ",80.087999999999994]
[null,216,"Pyrocatechol ",-2,9.4,12.8,null,null,null,null,20,0,"C6H6O2 ",110.1]
[null,217,"Pyrophosphoric ",-4,1.52,2.36,6.6,9.25,null,null,null,null,"H4P2O7 ",177.98]
[null,218,"Pyrrolidine ",0,11.27,null,null,null,null,null,25,0,"C4H9N "]
[null,219,"Pyruvic acid ",-1,2.39,null,null,null,null,null,25,0,"C3H4O3 ",88.06]
[null,220,"Quinine ",0,4.13,8.52,null,null,null,null,25,0,"C20H24N2O2 ",324.42]
[null,221,"Quinoline ",0,4.9000000000000004,null,null,null,null,null,20,0,"C9H7N ",129.16]
[null,222,"Resorcinol",-2,9.3000000000000007,11.06,null,null,null,null,25,0,"C6H6O2 ",110.1]
[null,223,"Saccharin ",-1,11.68,null,null,null,null,null,18,0,"C7H5NO3S "]
[null,224,"Salicylic acid",-2,2.97,13.74,null,null,null,null,25,0,"C7H6O3 ",138.12]
[null,225,"Selenic acid",-1,1.92,null,null,null,null,null,25,0,"H2SeO4"]
[null,226,"Selenous acid",-2,2.64,8.2799999999999994,null,null,null,null,null,0,"H2SeO3 "]
[null,227,"Serine ",-1,2.19,9.0500000000000007,null,null,null,null,25,0,"C3H7NO3",105.09]
[null,228,"o-Silicic acid",-2,9.66,11.7,null,null,null,null,null,null,"H4SiO4"]
[null,229,"m-Silicic acid",-2,9.6999999999999993,12,null,null,null,null,null,null,"H2SiO3"]
[null,230,"Sorbic acid",-1,4.76,null,null,null,null,null,null,null,"C6H8O2",112.13]
[null,231,"Strychnine ",0,8.26,null,null,null,null,null,25,0,"C21H22N2O2 ",334.41]
[null,232,"Succinic acid",-2,4.2069999999999999,5.6360000000000001,null,null,null,null,null,null,"HOOCCH2CH2COOH",118.09]
[null,233,"Sulfamic acid",-1,0.995,null,null,null,null,null,null,null,"H3NSO3",97.09]
[null,234,"Sulfuric acid",-2,-3,1.99,null,null,null,null,25,0,"H2SO4 ",98.08]
[null,235,"Sulfurous acid",-2,1.91,7.18,null,null,null,null,25,0,"H2SO3",82.07]
[null,236,"d-Tartaric acid",-2,3.036,4.3659999999999997,null,null,null,null,25,0,"C4H6O6 ",150.09]
[null,237,"meso-Tartaric acid ",-2,3.22,4.82,null,null,null,null,25,0,"C4H6O6 ",150.09]
[null,238,"Terephthalic acid ",-1,3.51,null,null,null,null,null,25,0,"C8H6O4 "]
[null,239,"Thiazole ",0,2.44,null,null,null,null,null,20,0,"C3H3NS "]
[null,240,"Thioacetic acid ",-1,3.33,null,null,null,null,null,25,0,"C2H4OS "]
[null,241,"Thiosulfuric acid",-2,0.6,1.63,null,null,null,null,25,0,"H2S2O3"]
[null,242,"Threonine",-1,2.0880000000000001,9.1,null,null,null,null,25,0,"C4H9NO3",119.12]
[null,243,"m-Toluic acid ",-1,4.2699999999999996,null,null,null,null,null,25,0,"C8H8O2 "]
[null,244,"o-Toluic acid ",-1,3.91,null,null,null,null,null,25,0,"C8H8O2 "]
[null,245,"p-Toluic acid ",-1,4.3600000000000003,null,null,null,null,null,25,0,"C8H8O2 "]
[null,246,"Trichloroacetic acid",-1,0.87,null,null,null,null,null,25,0,"Cl3CCOOH"]
[null,247,"Triethanolamine",0,7.7619999999999996,null,null,null,null,null,25,0,"(HOCH2CH2)3NH"]
[null,248,"Triethylamine",0,10.715,null,null,null,null,null,25,0,"(CH3CH2)3NH"]
[null,249,"Trimethylacetic acid   ",-1,5.03,null,null,null,null,null,25,0,"C5H10O2 "]
[null,250,"Trimethylamine",0,9.8000000000000007,null,null,null,null,null,25,0,"(CH3)3NH"]
[null,251,"Tris(hydroxymethyl)- aminomethane (tris)",0,8.0749999999999993,null,null,null,null,null,25,0,"(HOCH2)3CNH3"]
[null,252,"Tryptophan",-1,2.35,9.5399999999999991,null,null,null,null,25,0,"C11H12N2O2 "]
[null,253,"Tyramine ",0,9.74,10.52,null,null,null,null,25,0,"C8H11NO "]
[null,254,"Tyrosine ",-1,2.17,9.19,10.47,null,null,null,25,0,"C9H11NO3 "]
[null,255,"Urea ",0,0.1,null,null,null,null,null,21,0,"CH4N2O "]
[null,256,"Uric acid ",-1,3.89,null,null,null,null,null,12,0,"C5H4N4O3 "]
[null,257,"Valine ",-1,2.286,9.718,null,null,null,null,25,0,"C5H11NO2 "]
[null,258,"I N D I C A T O R S",null,null,null,null,null,null,null,null,null,null,null,"pKa","pH < pKa","pH = pKa","pH>pka",null,null,null,"Other color numbers"]
[null,259,"Thymol Blue (pKa 1.7)",-2,1.7,8.9,null,null,null,null,null,null,"C27H30O5S",466.59,1.7,5263615,4107000,4907000,null,null,"green",1701178,8374896,52377,7722000,1702000]
[null,260,"Methyl Orange (pKa 3.5)",-2,-1,3.47,null,null,null,null,null,null,"C14H14N3NaO3S",327.33,3.47,5263615,4961023,4907000,null,null,"blue",16763955,16750899,15456000]
[null,261,"Bromocresol Green (pKa 4.8)",-2,-1,4.8,null,null,null,null,null,null,"C21H14Br4O5S",698.01,4.8,4907000,52377,16750899,null,null,"red",7039480,5263615,14666000]
[null,262,"Methyl Red (pKa 5.1)",-1,5.0999999999999996,null,null,null,null,null,null,null,"C15H15N3O2",269.3,5.0999999999999996,5263615,4961023,4907000,null,null,"yellow",4907000,10285055,3339000,60395]
[null,263,"Bromothymol Blue (pKa 7.1)",-1,7.1,null,null,null,null,null,null,null,"C27H28Br2O5S",624.38,7.1,4907000,6813000,16750899,null,null,"white",16777215]
[null,264,"Phenol Red (pKa 7.7)",-2,1.2,7.7,null,null,null,null,null,null,"C19H14O5S",354.38,7.7,4907000,4961023,5263615,null,null,"orange",4961023]
[null,265,"Thymol Blue (pKa 8.9)",-2,1.7,8.9,null,null,null,null,null,null,"C27H30O5S",466.59,8.9,4907000,52377,16750899]
[null,266,"Phenolphthalein",-2,9.5,9.6999999999999993,null,null,null,null,null,null,"C20H14O4",318.32,9.6999999999999993,15395562,16564985,16419572]
[null,267,"Alizarine yellow R (pKa 11)",-1,11,null,null,null,null,null,null,null,"C13H9N3O5 ",287.23,11,4907000,4961023,5263615]
[null,268]
[null,269]
[null,270]
[null,271]
[null,272]
[null,273]
[null,274]
[null,275]
[null,276]
[null,277]
[null,278]
[null,279]
[null,280]